{"text_format":"1","workbook":"xlsx","n_sheets":15,"sheets":["Calendrier","Qui","Comment","Manche_1","Manche_2","Manche_3","Manche_4","Manche_5","Manche_6","Manche_7","Challenge_1","Challenge_2","Challenge_GJ","Champions_AN","A Ameliorer"],"not_rendered":{"charts":0,"images":3,"macros":1,"external_links":0,"defined_names":26,"comments":0,"pivot_tables":0},"unopened":[],"bounds":{"document_bytes":16777216,"sheet_cells":100000,"rows_first":2000,"rows_last":500,"rows_between":2000,"halvings":0,"cell_chars":16384,"cell_head_chars":4096},"cells_cut":0,"cells_raw":0,"read":"whole","date_system":"1900"}

{"sheet":"Calendrier","index":0,"n_rows":204,"n_cols":20,"rows_kept":204,"cut":false,"hidden":false,"merged":[[10,0,10,2],[10,5,10,6],[0,0,0,7],[1,0,1,2],[1,4,1,7],[3,0,3,2],[3,5,3,6],[53,0,53,2],[53,5,53,6],[17,0,17,2],[17,5,17,6],[21,4,21,7],[24,0,24,2],[24,5,24,6],[31,0,31,2],[31,3,37,5],[31,6,37,7],[38,0,38,7],[39,0,39,2],[39,5,39,6],[46,0,46,2],[46,5,46,6],[91,2,91,6],[92,2,92,6],[92,0,92,1],[60,0,60,2],[60,5,60,6],[67,0,67,2],[67,5,67,6],[74,0,74,2],[74,5,74,6],[87,0,87,2],[87,5,87,6],[89,0,89,7],[91,0,91,1],[81,0,81,2],[81,5,81,6]]}
["GRAND JEU NEUCHATELOIS",null,null,null,null,null,null,null,null,"mettre votre\nclub en évidence",null,2020,2019,2018,2017,2016,2015,2014,2013,2012]
["Entraînements",null,null,null,{"$f":"CONCATENATE(\"Compétitions \",YEAR(B6))","v":"Compétitions 2020"}]
[]
["Challenge HIVER",null,null,null,"Jeu :","Evologia",null,"Marquage",null,null,null,"Evologia","La  Vue-des-Alpes","La Chaux-de-Fonds","L'Epi","La  Vue-des-Alpes","La Chaux-de-Fonds","La Chaux-de-Fonds","L'Epi","La  Vue-des-Alpes"]
[]
["Lundi","2020-03-02","Le Locle",null,"Lundi",{"$f":"B6+7","v":"2020-03-09"},"Le Locle","La Vue-des-Alpes"]
["Mardi",{"$f":"B6+1","v":"2020-03-03"},"L'Epi",null,"Mardi",{"$f":"F6+1","v":"2020-03-10"},"L'Epi","La Vue-des-Alpes"]
["Mercredi",{"$f":"B7+1","v":"2020-03-04"},"La Chaux-de-Fonds",null,"Mercredi",{"$f":"F7+1","v":"2020-03-11"},"La Chaux-de-Fonds","La Vue-des-Alpes"]
["Jeudi",{"$f":"B8+1","v":"2020-03-05"},"La Vue-des-Alpes",null,"Jeudi",{"$f":"F8+1","v":"2020-03-12"},"La Vue-des-Alpes","L'Epi"]
[]
["Challenge 70ème",null,null,null,"Jeu :","L'Epi",null,"Marquage",null,"Nbre marquage",null,"L'Epi","La  Chaux-de-Fonds","Evologia","La Chaux-de-Fonds","Le Locle","L'Epi","La  Vue-des-Alpes","La Chaux-de-Fonds","Le Locle"]
[]
["Lundi","2020-03-23","Le Locle",null,"Lundi",{"$f":"B13+7","v":"2020-03-30"},"Le Locle",null,null,{"$f":"Qui!A201","v":"La Chaux-de-Fonds"},{"$f":"COUNTIF(H$6:H$87,J13)-COUNTIF(H$20:H$23,J13)","v":7}]
["Mardi",{"$f":"B13+1","v":"2020-03-24"},"L'Epi",null,"Mardi",{"$f":"F13+1","v":"2020-03-31"},"L'Epi",null,null,{"$f":"Qui!A202","v":"La Vue-des-Alpes"},{"$f":"COUNTIF(H$6:H$87,J14)-COUNTIF(H$20:H$23,J14)","v":7}]
["Mercredi",{"$f":"B14+1","v":"2020-03-25"},"La Chaux-de-Fonds",null,"Mercredi",{"$f":"F14+1","v":"2020-04-01"},"La Chaux-de-Fonds",null,null,{"$f":"Qui!A203","v":"Le Locle"},7]
["Jeudi",{"$f":"B15+1","v":"2020-03-26"},"La Vue-des-Alpes",null,"Jeudi",{"$f":"F15+1","v":"2020-04-02"},"La Vue-des-Alpes",null,null,{"$f":"Qui!A204","v":"L'Epi"},7]
[]
["COUPE SUISSE",null,null,null,"Jeu :","La  Vue-des-Alpes",null,"Les 2 clubs qui se qualifient\nmarquent l'un pour l'autre",null,null,null,"La Vue-des-Alpes","Evologia","Grand-Sommartel","Grand-Sommartel","La Chaux-de-Fonds","Le Locle","L'Epi","La  Vue-des-Alpes","La Chaux-de-Fonds"]
[]
["Lundi","2020-04-27","Le Locle",null,"Mercredi",{"$f":"B22+7","v":"2020-05-06"},"La Chaux-de-Fonds"]
["Mardi",{"$f":"B20+1","v":"2020-04-28"},"L'Epi",null,"Jeudi",{"$f":"F20+1","v":"2020-05-07"},"Le Locle"]
["Mercredi",{"$f":"B21+1","v":"2020-04-29"},"La Chaux-de-Fonds",null,"Les 16 meilleurs sont qualifiés et jouent le Tour Final dès 13h°°"]
["Jeudi",{"$f":"B22+1","v":"2020-04-30"},"La Vue-des-Alpes",null,"Samedi",{"$f":"F21+2","v":"2020-05-09"}]
[]
["Challenge ÉTÉ",null,null,null,"Jeu :","Le Locle",null,"Marquage",null,"Nbre jeu",null,"Le Locle","Grand-Sommartel","La  Vue-des-Alpes","Le Locle","L'Epi","La  Vue-des-Alpes","Le Locle","Le Locle","L'Epi"]
[]
["Lundi","2020-06-08","Le Locle",null,"Lundi",{"$f":"B27+7","v":"2020-06-15"},"Le Locle",null,null,{"$f":"Qui!B201","v":"Evologia"},{"$f":"COUNTIF(F$4:F$88,J27)","v":2}]
["Mardi",{"$f":"B27+1","v":"2020-06-09"},"L'Epi",null,"Mardi",{"$f":"F27+1","v":"2020-06-16"},"L'Epi",null,null,{"$f":"Qui!B202","v":"Grand-Sommartel"},1]
["Mercredi",{"$f":"B28+1","v":"2020-06-10"},"La Chaux-de-Fonds",null,"Mercredi",{"$f":"F28+1","v":"2020-06-17"},"La Chaux-de-Fonds",null,null,{"$f":"Qui!B203","v":"La  Chaux-de-Fonds"},1]
["Jeudi",{"$f":"B29+1","v":"2020-06-11"},"La Vue-des-Alpes",null,"Jeudi",{"$f":"F29+1","v":"2020-06-18"},"La Vue-des-Alpes",null,null,{"$f":"Qui!B204","v":"La  Vue-des-Alpes"},{"$f":"COUNTIF(F$4:F$88,J30)","v":2}]
[null,null,null,null,null,null,null,null,null,{"$f":"Qui!B205","v":"Le Locle"},{"$f":"COUNTIF(F$4:F$88,J31)","v":2}]
["Les N° de téléphone des Responsables des Jeux",null,null,"Toutes les compétitions,\n7.-- le requillage\n \nsauf la Coupe Suisse\n5.-- le requillage",null,null,"Les feuilles des résultats des compétitions sont à déposer ou à poster le jeudi soir chez :\n\nChristian Monnier\nRue des Marais 46\nLa Chaux-de-Fonds",null,null,{"$f":"Qui!B206","v":"L'Epi"},2]
["L'Epi","Blaise MORES  ","079 704 08 91",null,null,null,null,null,null,{"$f":"Qui!B207","v":"L'Erguel"},{"$f":"COUNTIF(F$4:F$88,J33)","v":0}]
["Le Locle","Lucien TYNOWSKI ","032 931 47 02"]
["La  Chaux-de-Fonds","Christian MONNIER","079 378 43 49"]
["La  Vue-des-Alpes","Hervé OPPLIGER","079 301 51 15"]
["Evologia","Daniel PELLATON","079 675 72 71"]
["Grand-Sommartel","Lucien TYNOWSKI ","032 931 47 02"]
[]
["Championnat 1ère manche",null,null,null,"Jeu :","Le Locle",null,"Marquage",null,null,null,"Le Locle","Grand-Sommartel","Grand-Sommartel","Le Locle","Le Locle","Le Locle","Le Locle","Le Locle","Le Locle"]
[]
["Lundi","2020-06-22","Le Locle",null,"Lundi",{"$f":"B42+7","v":"2020-06-29"},"Le Locle","La Vue-des-Alpes"]
["Mardi",{"$f":"B42+1","v":"2020-06-23"},"L'Epi",null,"Mardi",{"$f":"F42+1","v":"2020-06-30"},"L'Epi","Le Locle"]
["Mercredi",{"$f":"B43+1","v":"2020-06-24"},"La Chaux-de-Fonds",null,"Mercredi",{"$f":"F43+1","v":"2020-07-01"},"La Chaux-de-Fonds","Le Locle"]
["Jeudi",{"$f":"B44+1","v":"2020-06-25"},"La Vue-des-Alpes",null,"Jeudi",{"$f":"F44+1","v":"2020-07-02"},"La Vue-des-Alpes","Le Locle"]
[]
["Championnat 2ème manche",null,null,null,"Jeu :","Grand-Sommartel",null,"Marquage",null,null,null,"Grand-Sommartel","Le Locle","Le Locle","Grand-Sommartel","L'Epi","La  Vue-des-Alpes","L'Epi","Evologia","L'Epi"]
[]
["Lundi","2020-08-17","Le Locle",null,"Lundi",{"$f":"B49+7","v":"2020-08-24"},"Le Locle","La Chaux-de-Fonds"]
["Mardi",{"$f":"B49+1","v":"2020-08-18"},"L'Epi",null,"Mardi",{"$f":"F49+1","v":"2020-08-25"},"L'Epi","La Chaux-de-Fonds"]
["Mercredi",{"$f":"B50+1","v":"2020-08-19"},"La Chaux-de-Fonds",null,"Mercredi",{"$f":"F50+1","v":"2020-08-26"},"La Chaux-de-Fonds","Le Locle"]
["Jeudi",{"$f":"B51+1","v":"2020-08-20"},"La Vue-des-Alpes",null,"Jeudi",{"$f":"F51+1","v":"2020-08-27"},"La Vue-des-Alpes","Le Locle"]
[]
["Championnat 3ème manche",null,null,null,"Jeu :","L'Epi",null,"Marquage",null,null,null,"L'Erguel","La  Vue-des-Alpes","L'Epi","Evologia","La Chaux-de-Fonds","La Chaux-de-Fonds","Evologia","La  Vue-des-Alpes","La  Vue-des-Alpes"]
[]
["Lundi","2020-08-31","Le Locle",null,"Lundi",{"$f":"B56+7","v":"2020-09-07"},"Le Locle","L'Epi"]
["Mardi",{"$f":"B56+1","v":"2020-09-01"},"L'Epi",null,"Mardi",{"$f":"F56+1","v":"2020-09-08"},"L'Epi","La Vue-des-Alpes"]
["Mercredi",{"$f":"B57+1","v":"2020-09-02"},"La Chaux-de-Fonds",null,"Mercredi",{"$f":"F57+1","v":"2020-09-09"},"La Chaux-de-Fonds","L'Epi"]
["Jeudi",{"$f":"B58+1","v":"2020-09-03"},"La Vue-des-Alpes",null,"Jeudi",{"$f":"F58+1","v":"2020-09-10"},"La Vue-des-Alpes","L'Epi"]
[]
["Championnat 4ème manche",null,null,null,"Jeu :","La  Chaux-de-Fonds",null,"Marquage",null,null,null,"L'Epi","Evologia","Evologia","La  Vue-des-Alpes","La  Vue-des-Alpes","Evologia","La Chaux-de-Fonds","La Chaux-de-Fonds","Jeu erguel"]
[]
["Lundi","2020-09-28","Le Locle",null,"Lundi",{"$f":"B63+7","v":"2020-10-05"},"Le Locle","La Chaux-de-Fonds"]
["Mardi",{"$f":"B63+1","v":"2020-09-29"},"L'Epi",null,"Mardi",{"$f":"F63+1","v":"2020-10-06"},"L'Epi","La Chaux-de-Fonds"]
["Mercredi",{"$f":"B64+1","v":"2020-09-30"},"La Chaux-de-Fonds",null,"Mercredi",{"$f":"F64+1","v":"2020-10-07"},"La Chaux-de-Fonds","La Vue-des-Alpes"]
["Jeudi",{"$f":"B65+1","v":"2020-10-01"},"La Vue-des-Alpes",null,"Jeudi",{"$f":"F65+1","v":"2020-10-08"},"La Vue-des-Alpes","La Chaux-de-Fonds"]
[]
["Championnat 5ème manche",null,null,null,"Jeu :","Evologia",null,"Marquage",null,null,null,"Evologia","L'Epi","La  Vue-des-Alpes","La Chaux-de-Fonds","Evologia","L'Epi","La  Vue-des-Alpes","L'Epi"]
[]
["Lundi","2020-10-19","Le Locle",null,"Lundi",{"$f":"B70+7","v":"2020-10-26"},"Le Locle","L'Epi"]
["Mardi",{"$f":"B70+1","v":"2020-10-20"},"L'Epi",null,"Mardi",{"$f":"F70+1","v":"2020-10-27"},"L'Epi","La Vue-des-Alpes"]
["Mercredi",{"$f":"B71+1","v":"2020-10-21"},"La Chaux-de-Fonds",null,"Mercredi",{"$f":"F71+1","v":"2020-10-28"},"La Chaux-de-Fonds","L'Epi"]
["Jeudi",{"$f":"B72+1","v":"2020-10-22"},"La Vue-des-Alpes",null,"Jeudi",{"$f":"F72+1","v":"2020-10-29"},"La Vue-des-Alpes","L'Epi"]
[]
["Championnat 6ème manche",null,null,null,"Jeu :","La  Vue-des-Alpes",null,"Marquage",null,null,null,"La  Chaux-de-Fonds","La  Chaux-de-Fonds","La Chaux-de-Fonds","L'Epi","Jeu erguel","Jeu erguel","Jeu erguel","Jeu erguel"]
[]
["Lundi","2020-11-02","Le Locle",null,"Lundi",{"$f":"B77+7","v":"2020-11-09"},"Le Locle","La Chaux-de-Fonds"]
["Mardi",{"$f":"B77+1","v":"2020-11-03"},"L'Epi",null,"Mardi",{"$f":"F77+1","v":"2020-11-10"},"L'Epi","La Chaux-de-Fonds"]
["Mercredi",{"$f":"B78+1","v":"2020-11-04"},"La Chaux-de-Fonds",null,"Mercredi",{"$f":"F78+1","v":"2020-11-11"},"La Chaux-de-Fonds","Le Locle"]
["Jeudi",{"$f":"B79+1","v":"2020-11-05"},"La Vue-des-Alpes",null,"Jeudi",{"$f":"F79+1","v":"2020-11-12"},"La Vue-des-Alpes","Le Locle"]
[]
[null,null,null,null,"Jeu :",null,null,"Marquage",null,null,null,"La Vue-des-Alpes"]
[]
["Lundi",null,"Le Locle",null,"Lundi",{"$f":"B84+7","v":"1900-01-07"},"Le Locle"]
["Mardi",{"$f":"B84+1","v":"1900-01-01"},"L'Epi",null,"Mardi",{"$f":"F84+1","v":"1900-01-08"},"L'Epi"]
["Mercredi",{"$f":"B85+1","v":"1900-01-02"},"La Chaux-de-Fonds",null,"Mercredi",{"$f":"F85+1","v":"1900-01-09"},"La Chaux-de-Fonds"]
["Jeudi",{"$f":"B86+1","v":"1900-01-03"},"La Vue-des-Alpes",null,"Jeudi",{"$f":"F86+1","v":"1900-01-10"},"La Vue-des-Alpes"]
[]
[]
[{"$f":"CONCATENATE(\"Rappel pour le Championnat neuchâtelois:  \",CHAR(10),\" individuel  seuls comptent les \",Qui!$A$402,\" meilleurs résultats\",CHAR(10),\" par club  seuls comptent les \",Qui!$B$402,\" meilleurs résultats\")","v":"Rappel pour le Championnat neuchâtelois:  \n individuel  seuls comptent les 5 meilleurs résultats\n par club  seuls comptent les 5 meilleurs résultats"}]
[]
["Remise des prix",null,"jeudi 26 novembre 2020 à 19h30 précise\nau jeu des Tunnels"]
["Organisation",null,"La Vue-des-Alpes",null,null,null,null,null,null,null,null,"La  Chaux-de-Fonds","La  Chaux-de-Fonds","Le Locle","L'Epi","La  Vue-des-Alpes","La Chaux-de-Fonds","Le Locle","L'Epi","La  Vue-des-Alpes"]
[]
[]
[]
[]
[]
[]
[]
[]
[]
[]
[]
[]
[]
[]
[]
[]
[]
[]
[]
[]
[]
[]
[]
[]
[]
[]
[]
[]
[]
[]
[]
[]
[]
[]
[]
[]
[]
[]
[]
[]
[]
[]
[]
[]
[]
[]
[]
[]
[]
[]
[]
[]
[]
[]
[]
[]
[]
[]
[]
[]
[]
[]
[]
[]
[]
[]
[]
[]
[]
[]
[]
[]
[]
[]
[]
[]
[]
[]
[]
[]
[]
[]
[]
[]
[]
[]
[]
[]
[]
[]
[]
[]
[]
[]
[]
[]
[]
[]
[]
[]
[]
[]
[]
[]
[]
[]
[]
[]
[]
[]
[null,null,null,null,null,"Duplicata Colonne A\ntechnique"]

{"sheet":"Qui","index":1,"n_rows":513,"n_cols":16,"rows_kept":513,"cut":false,"hidden":true,"merged":[[196,8,196,9],[199,8,199,9],[413,2,416,2]]}
[]
[]
[]
[]
[]
[]
[]
[]
[]
[]
[]
[]
[]
[]
[]
[]
[]
[]
[]
[]
[]
[]
[]
[]
[]
[]
[]
[]
[]
[]
[]
[]
[]
[]
[]
[]
[]
[]
[]
[]
[]
[]
[]
[]
[]
[]
[]
[]
[]
[]
[]
[]
[]
[]
[]
[]
[]
[]
[]
[]
[]
[]
[]
[]
[]
[]
[]
[]
[]
[]
[]
[]
[]
[]
[]
[]
[]
[]
[]
[]
[]
[]
[]
[]
[]
[]
[]
[]
[]
[]
[]
[]
[]
[]
[]
[]
[]
[]
[]
[]
[]
[]
[]
[]
[]
[]
[]
[]
[]
[]
[]
[]
[]
[]
[]
[]
[]
[]
[]
[]
[]
[]
[]
[]
[]
[]
[]
[]
[]
[]
[]
[]
[]
[]
[]
[]
[]
[]
[]
[]
[]
[]
[]
[]
[]
[]
[]
[]
[]
[]
[]
[]
[]
[]
[]
[]
[]
[]
[]
[]
[]
[]
[]
[]
[]
[]
[]
[]
[]
[]
[]
[]
[]
[]
[]
[]
[]
[]
[]
[]
[]
[]
[]
[]
[]
[]
[]
[]
[]
[]
[]
[]
[]
[]
[]
["Inventaire des  Club, Jeux, choix des couleurs"]
["Club Texte","Pour lui-même","Pour lui-même","Choix de la couleur club \npour chque club","Couleur club texte","Duplicata Colonne A\ntechnique",null,null,"Lien entre n° couleur et texte\n==> mise en forme conditionnelle"]
[null,null,null,null,"Non modifiable","Non modifiable","Non modifiable",null,"Non modifiable","Non modifiable"]
[]
["Les_Clubs","Les_Jeux","Les_compétitions","CLUB n°","Couleur","Copie_Les_Clubs","Nb joueurs",null,"Définition des couleurs"]
["La Chaux-de-Fonds","Evologia","Challenge 70ème",1,{"$f":"(VLOOKUP(Liste319[[#This Row],[CLUB n°]],I201:J205,2,0))","v":"bleu"},{"$f":"Liste117[[#This Row],[Les_Clubs]]","v":"La Chaux-de-Fonds"},{"$f":"COUNTIF(E$301:E$355,A201)","v":12},null,1,"bleu"]
["La Vue-des-Alpes","Grand-Sommartel","Challenge ÉTÉ",2,{"$f":"(VLOOKUP(Liste319[[#This Row],[CLUB n°]],I202:J206,2,0))","v":"grisé"},{"$f":"Liste117[[#This Row],[Les_Clubs]]","v":"La Vue-des-Alpes"},{"$f":"COUNTIF(E$301:E$355,A202)","v":7},null,2,"grisé"]
["Le Locle","La  Chaux-de-Fonds","Challenge HIVER",3,{"$f":"(VLOOKUP(Liste319[[#This Row],[CLUB n°]],I203:J207,2,0))","v":"vert"},{"$f":"Liste117[[#This Row],[Les_Clubs]]","v":"Le Locle"},6,null,3,"vert"]
["L'Epi","La  Vue-des-Alpes","Championnat 1ère manche",4,{"$f":"(VLOOKUP(Liste319[[#This Row],[CLUB n°]],I204:J208,2,0))","v":"jaune"},{"$f":"Liste117[[#This Row],[Les_Clubs]]","v":"L'Epi"},9,null,4,"jaune"]
[null,"Le Locle","Championnat 2ème manche",5,{"$f":"(VLOOKUP(Liste319[[#This Row],[CLUB n°]],I205:J209,2,0))","v":"rouge (réserve)"},{"$f":"Liste117[[#This Row],[Les_Clubs]]","v":0},null,null,5,"rouge (réserve)"]
[null,"L'Epi","Championnat 3ème manche",null,null,{"$f":"Liste117[[#This Row],[Les_Clubs]]","v":0},null,null,null,"le reste est blanc"]
[null,"L'Erguel","Championnat 4ème manche",null,null,{"$f":"Liste117[[#This Row],[Les_Clubs]]","v":0}]
[null,null,"Championnat 5ème manche",null,null,{"$f":"Liste117[[#This Row],[Les_Clubs]]","v":0}]
[null,null,"Championnat 6ème manche",null,null,{"$f":"Liste117[[#This Row],[Les_Clubs]]","v":0}]
[null,null,"Championnat 7ème manche",null,null,{"$f":"Liste117[[#This Row],[Les_Clubs]]","v":0},"Total clubistes"]
[null,null,"COUPE SUISSE",null,null,{"$f":"Liste117[[#This Row],[Les_Clubs]]","v":0},{"$f":"SUM(G201:G210)","v":34}]
[]
[]
[]
[]
[]
[]
[]
[]
[]
[]
[]
[]
[]
[]
[]
[]
[]
[]
[]
[]
[]
[]
[]
[]
[]
[]
[]
[]
[]
[]
[]
[]
[]
[]
[]
[]
[]
[]
[]
[]
[]
[]
[]
[]
[]
[]
[]
[]
[]
[]
[]
[]
[]
[]
[]
[]
[]
[]
[]
[]
[]
[]
[]
[]
[]
[]
[]
[]
[]
[]
[]
[]
[]
[]
[]
[]
[]
[]
[]
[]
[]
[]
[]
[]
["Les Membres"]
[]
[null,null,"Non modifiable","Non modifiable",null,"Non modifiable","Non modifiable","Non modifiable"]
[]
["Nom","Prenom","NomPrenom","NP","ClubNom","ClubNo","Nom dupl","Prénom dupl","Rue","NPA","Ville","Tél","Courriel","Date de \nnaissance","Joueur \ndepuis","J'utilise\nWhatsapp"]
["Bart","Fabien",{"$f":"CONCATENATE(A301,\" \",B301)","v":"Bart Fabien"},{"$f":"CONCATENATE(A301,B301)","v":"BartFabien"},"Le Locle",{"$f":"(VLOOKUP(E301,Qui!$A$201:$D$211,4))","v":3},{"$f":"A301","v":"Bart"},{"$f":"B301","v":"Fabien"},"La Sagne Eglise 145a",2314,"La Sagne","+41796958609",null,null,"1993-01-01"]
["Billod-Morel","Gérald","Billod-Morel Gérald","Billod-MorelGérald","La Chaux-de-Fonds",{"$f":"(VLOOKUP(E302,Qui!$A$201:$D$211,4))","v":1},"Billod-Morel","Gérald","Cornes-Morel 41",2300,"La Chaux-de-Fonds","+41798221983","geraldbillod@gmail.com","1971-08-01","2017-01-01","oui"]
["Bourquin","Willy","Bourquin Willy","BourquinWilly","L'Epi",{"$f":"(VLOOKUP(E303,Qui!$A$201:$D$211,4))","v":4},"Bourquin","Willy","Les Vieux-Prés 2",2054,"Les Vieux-Prés","+41 79 125 29 97","wbourquin@bluewin.ch","1944-03-22","2012-01-01","oui"]
["Bühler","Raymond","Bühler Raymond","BühlerRaymond","L'Epi",{"$f":"(VLOOKUP(E304,Qui!$A$201:$D$211,4))","v":4},"Bühler","Raymond","Rue du Parc 11",2300,"La Chaux-de-Fonds","+41794713615","rbuhler@hispeed.ch","1949-06-01","1986-01-01","oui"]
["Cassi","Alain","Cassi Alain","CassiAlain","Le Locle",{"$f":"(VLOOKUP(E305,Qui!$A$201:$D$211,4))","v":3},"Cassi","Alain","les Bulles 18",2300,"La Chaux-de-Fonds","+41329681245","alainvero@gmail.com",null,"D 1990"]
["Charlet","Léon","Charlet Léon","CharletLéon","La Vue-des-Alpes",{"$f":"(VLOOKUP(E306,Qui!$A$201:$D$211,4))","v":2},"Charlet","Léon","Fritz-Courvoisier 21",2300,"La Chaux-de-Fonds","+41795107075","leonchat@outlook.com","1998-04-02","2019-01-01","oui"]
["Chassot","Yves","Chassot Yves","ChassotYves","La Vue-des-Alpes",{"$f":"(VLOOKUP(E307,Qui!$A$201:$D$211,4))","v":2},"Chassot","Yves","Combes 3",2042,"Fontaines","+41 79 482 96 88","yves.chassot@gmail.com","1971-02-05","2000-01-01","oui"]
["Dick","Pierre-Alain","Dick Pierre-Alain","DickPierre-Alain","La Vue-des-Alpes",{"$f":"(VLOOKUP(E308,Qui!$A$201:$D$211,4))","v":2},"Dick","Pierre-Alain","La Biche 1",2054,"Les Vieux-Prés","* 032 853 27 40  +41 79 796 32 34","pierre-alain.dick@ne.ch","1967-07-27","1997-01-01","oui"]
["Dubois","Emmanuel","Dubois Emmanuel","DuboisEmmanuel","La Chaux-de-Fonds",{"$f":"(VLOOKUP(E309,Qui!$A$201:$D$211,4))","v":1},"Dubois","Emmanuel","Route des Provins 2",2087,"Cornaux","+41798980701","emmanuel.dubois93@gmail.com","1993-04-05","2019-01-01","oui"]
["Dubois","Eric","Dubois Eric","DuboisEric","La Chaux-de-Fonds",{"$f":"(VLOOKUP(E310,Qui!$A$201:$D$211,4))","v":1},"Dubois","Eric","Route de Cottendart 15",2013,"Colombier","+41763160852","eric.dubois311@gmail.com","1972-03-26","2016-01-01","oui"]
["Dubois","Marcel","Dubois Marcel","DuboisMarcel","La Chaux-de-Fonds",{"$f":"(VLOOKUP(E311,Qui!$A$201:$D$211,4))","v":1},"Dubois","Marcel","Rue du Locle 32",2300,"La Chaux-de-Fonds","+41764233384 +41329144618",null,"1994-12-14","1970-01-01"]
["Favre","Daniel","Favre Daniel","FavreDaniel","Le Locle",{"$f":"(VLOOKUP(E312,Qui!$A$201:$D$211,4))","v":3},"Favre","Daniel","Rue Jardinière 113",2300,"La Chaux-de-Fonds","+41794458191 +41329134030",null,null,"2010-01-01","oui"]
["Frutiger","Bertrand","Frutiger Bertrand","FrutigerBertrand","L'Epi",{"$f":"(VLOOKUP(E313,Qui!$A$201:$D$211,4))","v":4},"Frutiger","Bertrand","Impasse des Saules 1",2053,"Cernier","+41794011093 +41328532139",null,null,"2010-01-01"]
["Geiser","Willy","Geiser Willy","GeiserWilly","La Chaux-de-Fonds",{"$f":"(VLOOKUP(E314,Qui!$A$201:$D$211,4))","v":1},"Geiser","Willy","Grand Rue",2052,"Fontainemelon",null,null,null,"D 1990"]
["Gerber","Michel","Gerber Michel","GerberMichel","Le Locle",{"$f":"(VLOOKUP(E315,Qui!$A$201:$D$211,4))","v":3},"Gerber","Michel","Rue du St-Gothard 34",2300,"La Chaux-de-Fonds","+41329269296    +41799265851  ",null,"1965-06-05","2013-01-01"]
["Haussener","Philippe","Haussener Philippe","HaussenerPhilippe","La Vue-des-Alpes",{"$f":"(VLOOKUP(E316,Qui!$A$201:$D$211,4))","v":2},"Haussener","Philippe","Chemin de la Pépinière 1",2046,"Fontaines","+41 79 213 81 65","haussenerphv@gmail.com","1968-01-03","2014-01-01","oui"]
["Jean-Mairet","Jean-Claude","Jean-Mairet Jean-Claude","Jean-MairetJean-Claude","La Chaux-de-Fonds",{"$f":"(VLOOKUP(E317,Qui!$A$201:$D$211,4))","v":1},"Jean-Mairet","Jean-Claude","Progrès 103",2300,"La Chaux-de-Fonds","+41329135462",null,"29.05.194","2015-01-01"]
["Jeanneret","Louis","Jeanneret Louis","JeanneretLouis","La Vue-des-Alpes",{"$f":"(VLOOKUP(E318,Qui!$A$201:$D$211,4))","v":2},"Jeanneret","Louis","Rue de la Promenade 14",2052,"Fontainemelon","+41 79 796 39 19  +41328536368","louis.jeanneret@ne.ch","1976-04-02","2001-01-01","oui"]
["Kemajl","Fetahi","Kemajl Fetahi","KemajlFetahi","Le Locle",{"$f":"(VLOOKUP(E319,Qui!$A$201:$D$211,4))","v":3},"Kemajl","Fetahi",null,null,null,null,null,null,"2015-01-01"]
["Matthey","Pierre","Matthey Pierre","MattheyPierre","La Chaux-de-Fonds",{"$f":"(VLOOKUP(E320,Qui!$A$201:$D$211,4))","v":1},"Matthey","Pierre","Rue des Bouleaux 1",2300,"La Chaux-de-Fonds","+41793489512","pierrotmatthey@bluewin.ch","1951-09-27","1972-01-01","non"]
["Monnier","Christian","Monnier Christian","MonnierChristian","La Chaux-de-Fonds",{"$f":"(VLOOKUP(E321,Qui!$A$201:$D$211,4))","v":1},"Monnier","Christian","Rue du Marais 46",2300,"La Chaux-de-Fonds","+41793784349 +41329681347","csmonnier@bluewin.ch","1962-08-30","2003-01-01","oui"]
["Monnier","Marion","Monnier Marion","MonnierMarion","La Chaux-de-Fonds",{"$f":"(VLOOKUP(E322,Qui!$A$201:$D$211,4))","v":1},"Monnier","Marion",null,null,null,null,null,null,"2016-01-01"]
["Mores","Blaise","Mores Blaise","MoresBlaise","L'Epi",{"$f":"(VLOOKUP(E323,Qui!$A$201:$D$211,4))","v":4},"Mores","Blaise","Boulevard des Endroits 42",2300,"La Chaux-de-Fonds","+41797040891\n+41329267877","catherinemonnin@gmail.com","1962-10-02","1990 a ver","oui"]
["Oppliger","Hervé","Oppliger Hervé","OppligerHervé","La Vue-des-Alpes",{"$f":"(VLOOKUP(E324,Qui!$A$201:$D$211,4))","v":2},"Oppliger","Hervé","Le Crêt du Châble 7",2057,"Villiers"," +41 79 301 51 15 +41328534052","h.oppliger57@bluewin.ch","1957-01-26","2009-01-01","oui"]
["Pellaton","Daniel","Pellaton Daniel","PellatonDaniel","L'Epi",{"$f":"(VLOOKUP(E325,Qui!$A$201:$D$211,4))","v":4},"Pellaton","Daniel","Rue des Pierres Grises 17",2053,"Cernier","+41796757271\n+41328520443","daniel@pellaton.ch","1958-09-13","2008-01-01","oui"]
["Reichen","Sylvain","Reichen Sylvain","ReichenSylvain","L'Epi",{"$f":"(VLOOKUP(E326,Qui!$A$201:$D$211,4))","v":4},"Reichen","Sylvain","Rue des Terraux 41",2300,"La Chaux-de-Fonds","+41797680522 +41329685392",null,"1944-12-08","1972-01-01","non"]
["Rindlisbacher","Heinz","Rindlisbacher Heinz","RindlisbacherHeinz","L'Epi",{"$f":"(VLOOKUP(E327,Qui!$A$201:$D$211,4))","v":4},"Rindlisbacher","Heinz","Chemin du Mont d'Amin 2",2052,"Fontainemelon","+41794791816","heguriba@gmail.com","1956-02-08","2014-01-01","oui"]
["Rollat","Christian","Rollat Christian","RollatChristian","La Chaux-de-Fonds",{"$f":"(VLOOKUP(E328,Qui!$A$201:$D$211,4))","v":1},"Rollat","Christian","Rue du Crêt 2",2300,"La Chaux-de-Fonds","+41793320738  +41329684491","rollat.christian@gmail.com","1962-03-04","2011-01-01","non"]
["Rossier","Yves-Alain","Rossier Yves-Alain","RossierYves-Alain","L'Epi",{"$f":"(VLOOKUP(E329,Qui!$A$201:$D$211,4))","v":4},"Rossier","Yves-Alain","Les Vieux-Prés 3",2054,"Les Vieux-Prés","+41797139187  +41328532179","yarossier@bluewin.ch","1962-04-03","2013-01-01","oui"]
["Tinguely","Didier","Tinguely Didier","TinguelyDidier","La Chaux-de-Fonds",{"$f":"(VLOOKUP(E330,Qui!$A$201:$D$211,4))","v":1},"Tinguely","Didier","Chemin des Sorbiers 21",2400,"Le Locle","+41329314702",null,null,"2019-01-01"]
["Tynowski","Lucien","Tynowski Lucien","TynowskiLucien","Le Locle",{"$f":"(VLOOKUP(E331,Qui!$A$201:$D$211,4))","v":3},"Tynowski","Lucien","Chemin des Sorbiers 21",2400,"Le Locle","+41796703979   +41329314702","cl.tynowski@hispeed.ch",null,"D 1990","oui"]
["Voirol","Pierre","Voirol Pierre","VoirolPierre","La Chaux-de-Fonds",{"$f":"(VLOOKUP(E332,Qui!$A$201:$D$211,4))","v":1},"Voirol","Pierre","Rue Charles-Humbert 8",2300,"La Chaux-de-Fonds","+41329132256","pierre.voirol@gmail.com","1962-01-25","2014-01-01","oui"]
["Vuillème","Claude-Alain",{"$f":"CONCATENATE(A333,\" \",B333)","v":"Vuillème Claude-Alain"},{"$f":"CONCATENATE(A333,B333)","v":"VuillèmeClaude-Alain"},"La Vue-des-Alpes",{"$f":"(VLOOKUP(E333,Qui!$A$201:$D$211,4))","v":2},{"$f":"A333","v":"Vuillème"},{"$f":"B333","v":"Claude-Alain"},"Les Loges 18",2052,"La Vue-des-Alpes","+41328535225 +41794484301","ca.vuilleme@gmail.com","1964-06-02","2009-01-01","oui"]
["Wäfler","Jean-Louis","Wäfler Jean-Louis","WäflerJean-Louis","L'Epi",{"$f":"(VLOOKUP(E334,Qui!$A$201:$D$211,4))","v":4},"Wäfler","Jean-Louis","Les Foulets 7",2300,"La Chaux-de-Fonds"," +41774229744 +41329136443",null,null,"D 1990","non"]
["ZZ1","Z2","ZZ1 Z2","ZZ1Z2",null,{"$f":"(VLOOKUP(E335,Qui!$A$201:$D$211,4))","v":{"$error":"#N/A"}},"ZZ1","Z2"]
["ZZ1","Z2","ZZ1 Z2","ZZ1Z2",null,{"$f":"(VLOOKUP(E336,Qui!$A$201:$D$211,4))","v":{"$error":"#N/A"}},"ZZ1","Z2"]
["ZZ1","Z2","ZZ1 Z2","ZZ1Z2",null,{"$f":"(VLOOKUP(E337,Qui!$A$201:$D$211,4))","v":{"$error":"#N/A"}},"ZZ1","Z2"]
["ZZ1","Z2","ZZ1 Z2","ZZ1Z2",null,{"$f":"(VLOOKUP(E338,Qui!$A$201:$D$211,4))","v":{"$error":"#N/A"}},"ZZ1","Z2"]
["ZZ1","Z2","ZZ1 Z2","ZZ1Z2",null,{"$f":"(VLOOKUP(E339,Qui!$A$201:$D$211,4))","v":{"$error":"#N/A"}},"ZZ1","Z2"]
["ZZ1","Z2","ZZ1 Z2","ZZ1Z2",null,{"$f":"(VLOOKUP(E340,Qui!$A$201:$D$211,4))","v":{"$error":"#N/A"}},"ZZ1","Z2"]
["ZZ1","Z2","ZZ1 Z2","ZZ1Z2",null,{"$f":"(VLOOKUP(E341,Qui!$A$201:$D$211,4))","v":{"$error":"#N/A"}},"ZZ1","Z2"]
["ZZ1","Z2","ZZ1 Z2","ZZ1Z2",null,{"$f":"(VLOOKUP(E342,Qui!$A$201:$D$211,4))","v":{"$error":"#N/A"}},"ZZ1","Z2"]
["ZZ1","Z2","ZZ1 Z2","ZZ1Z2",null,{"$f":"(VLOOKUP(E343,Qui!$A$201:$D$211,4))","v":{"$error":"#N/A"}},"ZZ1","Z2"]
["ZZ1","Z2","ZZ1 Z2","ZZ1Z2",null,{"$f":"(VLOOKUP(E344,Qui!$A$201:$D$211,4))","v":{"$error":"#N/A"}},"ZZ1","Z2"]
["ZZ1","Z2","ZZ1 Z2","ZZ1Z2",null,{"$f":"(VLOOKUP(E345,Qui!$A$201:$D$211,4))","v":{"$error":"#N/A"}},"ZZ1","Z2"]
["ZZ1","Z2","ZZ1 Z2","ZZ1Z2",null,{"$f":"(VLOOKUP(E346,Qui!$A$201:$D$211,4))","v":{"$error":"#N/A"}},"ZZ1","Z2"]
["ZZ1","Z2","ZZ1 Z2","ZZ1Z2",null,{"$f":"(VLOOKUP(E347,Qui!$A$201:$D$211,4))","v":{"$error":"#N/A"}},"ZZ1","Z2"]
["ZZ1","Z2","ZZ1 Z2","ZZ1Z2",null,{"$f":"(VLOOKUP(E348,Qui!$A$201:$D$211,4))","v":{"$error":"#N/A"}},"ZZ1","Z2"]
["ZZ1","Z2","ZZ1 Z2","ZZ1Z2",null,{"$f":"(VLOOKUP(E349,Qui!$A$201:$D$211,4))","v":{"$error":"#N/A"}},"ZZ1","Z2"]
["ZZ1","Z2","ZZ1 Z2","ZZ1Z2",null,{"$f":"(VLOOKUP(E350,Qui!$A$201:$D$211,4))","v":{"$error":"#N/A"}},"ZZ1","Z2"]
["ZZ1","Z2","ZZ1 Z2","ZZ1Z2",null,{"$f":"(VLOOKUP(E351,Qui!$A$201:$D$211,4))","v":{"$error":"#N/A"}},"ZZ1","Z2"]
["ZZ1","Z2","ZZ1 Z2","ZZ1Z2",null,{"$f":"(VLOOKUP(E352,Qui!$A$201:$D$211,4))","v":{"$error":"#N/A"}},"ZZ1","Z2"]
["ZZ1","Z2","ZZ1 Z2","ZZ1Z2",null,{"$f":"(VLOOKUP(E353,Qui!$A$201:$D$211,4))","v":{"$error":"#N/A"}},"ZZ1","Z2"]
["ZZ1","Z2","ZZ1 Z2","ZZ1Z2",null,{"$f":"(VLOOKUP(E354,Qui!$A$201:$D$211,4))","v":{"$error":"#N/A"}},"ZZ1","Z2"]
[]
[]
[]
[]
[]
[]
[]
[]
[]
[]
[]
[]
[]
[]
[]
[]
[]
[]
[]
[]
[]
[]
[]
[]
[]
[]
[]
[]
[]
[]
[]
[]
[]
[]
[]
[]
[]
[]
[]
[]
[]
[]
[]
["Eléments techniques - Règlements de jeu"]
["Championnat ","Championnat "]
["Classement général individuel","Classement par club"]
["Nombre de résultats \nqui comptent ","Nombre de résultats\npar équipe"]
[5,5]
[]
[]
[]
[]
[]
[]
[]
[]
["Outils"]
[]
[]
[null,null,1]
[null,null,null,1,"Modifications impossibles, classeurs et feuilles protégés"]
[null,null,null,0,"Modifications possibles, Classeurs et feuilles libres (ATTENTION)"]
[]
[]
[]
[]
[]
[null,null,null,"mot de passe : aa"]
[]
[]
[]
[]
[]
[]
[]
[]
[]
[]
[]
[]
[]
[]
[]
[]
[]
[]
[]
[]
[]
[]
[]
[]
[]
[]
[]
[]
[]
[]
[]
[]
[]
[]
[]
[]
[]
[]
[]
[]
[]
[]
[]
[]
[]
[]
[]
[]
[]
[]
[]
[]
[]
[]
[]
[]
[]
[]
[]
[]
[]
[]
[]
[]
[]
[]
[]
[]
[]
[]
[]
[]
[]
[]
[]
[]
[]
["ANCIENS MEMBRES"]
[]
[null,null,"Non modifiable","Non modifiable",null,"Non modifiable","Non modifiable","Non modifiable"]
[]
["Nom","Prenom","NomPrenom","NP","ClubNom","ClubNo","Nom dupl","Prénom dupl","Rue","NPA","Ville","Tél","Courriel","Date de \nnaissance","Joueur \ndepuis","J'utilise\nWhatsapp"]
["Blaser","Jean-Pierre","Blaser Jean-Pierre","BlaserJean-Pierre","La Chaux-de-Fonds",4,"Blaser","Jean-Pierre","Rue de la Croix-Fédérale 48",2300,"La Chaux-de-Fonds","+41329132040"]
["Cuche","Roland","Cuche Roland","CucheRoland","La Vue-des-Alpes",1,"Cuche","Roland","Rue de la Chapelle 8",2208,"Les Hauts-Geneveys NE","* 032 853 55 89"]
["Dubois","Georges","Dubois Georges","DuboisGeorges","La Chaux-de-Fonds",4,"Dubois","Georges","Rue de la Charrière 42",2300,"La Chaux-de-Fonds","+41774520866\n+41329688312"]
["Kiepfer","Marcel","Kiepfer Marcel","KiepferMarcel","La Vue-des-Alpes",1,"Kiepfer","Marcel","Rue Monique-St-Hélier 7",2300,"La Chaux-de-Fonds","+41796112760\n+41329681796","mkipfer@hispeed.ch"]
["Monnier","Marion",{"$f":"CONCATENATE(A509,\" \",B509)","v":"Monnier Marion"},{"$f":"CONCATENATE(A509,B509)","v":"MonnierMarion"},"La Chaux-de-Fonds",{"$f":"(VLOOKUP(E509,Qui!$A$201:$D$211,4))","v":1},{"$f":"A509","v":"Monnier"},{"$f":"B509","v":"Marion"},null,null,null,null,null,null,"2016-01-01"]
["Oppliger","Sylvain","Oppliger Sylvain","OppligerSylvain","Le Locle",2,"Oppliger","Sylvain","Route de la Croix 34",1589,"Chabrey",null,"sylvano73@hotmail.com"]
["Oppliger","Sylvain",{"$f":"CONCATENATE(A511,\" \",B511)","v":"Oppliger Sylvain"},{"$f":"CONCATENATE(A511,B511)","v":"OppligerSylvain"},"Le Locle",{"$f":"(VLOOKUP(E511,Qui!$A$201:$D$211,4))","v":3},{"$f":"A511","v":"Oppliger"},{"$f":"B511","v":"Sylvain"},null,null,null,null,null,null,"1996-01-01"]
["Rollat","Christian","Rollat Christian","RollatChristian","La Chaux-de-Fonds",4,"Rollat","Christian","Rue du Crêt 2",2300,"La Chaux-de-Fonds","+41329684491"]
["Vuagneux","Charles","Vuagneux Charles","VuagneuxCharles","L'Epi",5,"Vuagneux","Charles",null,2300,"La Chaux-de-Fonds","+41794881660\n+41329688369"]

{"sheet":"Comment","index":2,"n_rows":181,"n_cols":6,"rows_kept":181,"cut":false,"hidden":true,"merged":[]}
["Onglet Calendrier"]
[]
["Choisir la compétition dans la liste déroulante "]
["Choisir le Jeu (pont) dans la liste déroulante"]
["Remplir la première date de l'entrainement et les suivantes se mettent automatiquement"]
["Choisir les clubs marqueurs (Un décompte du nombre de marquages ce fait automatiquement)"]
["Attention pour les compétitions à Evologia au regard des examens des Fleuristes (en général début juin)"]
["Si possible tenir comptes des vacances scolaires et de la fermeture du restaurant du Grand-Sommartel"]
[]
["Modifier les dates de Fête La Terre"]
["Mentionner les dates de la Vauquille"]
[]
["Dans le rappel, le nombre de résultats pris en compte provient automatiquement de l'Onglet Qui (Eléments techniques)"]
[]
[]
[]
[]
[]
["Onglet Qui"]
[]
[{"$f":"Qui!A196","v":"Inventaire des  Club, Jeux, choix des couleurs"}]
[]
["L'exactitude du nom des clubs est IMPERATIVE (On ne peut plus changer)"]
["Chaque entité doit être triée pour elle-même :"]
["- Les_Clubs"]
["- Les Jeux"]
["- Les Compétitions"]
[]
["Le lien couleur entre les_Clubs et Clubs n° se fait entre colonne A et D"]
[]
["On découvre aussi la répartition des joueurs entre les clubs"]
[]
[{"$f":"Qui!A296","v":"Les Membres"}]
["Possibilité d'introduire 55 joueurs"]
[]
["Introduire les joueurs (Nom, Prénom,  Club, Rue, NPA, Ville, Tél, e-mail) le reste est automatique"]
["Les colonnes C, D, F, G et H sont automatiques (ne pas les remplir)"]
[]
[" ==> Si pas trié alors les couleurs des joueurs peuvent être fausses (lancer macro dans Qui \"Trier les membres\")"]
[]
[]
[]
[]
[{"$f":"Qui!A398","v":"Eléments techniques - Règlements de jeu"}]
[]
["Ces éléments sont à vérifier en début de saison :"]
["- Nombre de résultats à comptabiliser par joueur sur le championnat (si tous alors mettre 6 identique au nombre de manches de la saison)"]
["- Nombre de joueurs par équipe pour le championnat ==> on cumule donc les x meilleurs résultats du club de chaque manche)"]
[]
[]
[{"$f":"Qui!A411","v":"Outils"}]
[]
["Possibilité de dévérouiller et d'effectuer des modifications "]
[]
["Lancement du tri des membres "]
[]
[]
["Onglets Challenge_x"]
[]
[]
["Les cellules des scores non remplies doivent être à 0"]
["(pour remplir plusieures cellules en 1 fois, sélectionner toutes les cellules voulues, presser sur zéro et pour valider presser sur Ctrl-Return)"]
[]
["Possibilité d'introduire jusqu'à  49 joueurs"]
[]
[]
["En cas d'égalité entre plusieurs joueurs,  pour les \"départager\" selon les critères de l'art 4 :"]
["==> il faut ajouter . 01 (ou rien)  pour le moins bon et jusqu'à .07 pour le meilleur"]
[]
[]
["Pour la manche "]
[]
["a) Introduire les scores sur le classement individuel (Colonnes H6 à J54) en accord avec les membres (Qui)"]
["- Colonne H : Nom"]
["- Colonne I : Prénom"]
["- Colonne J : Score de la manche"]
[]
["b) Une fois les scores de tous les joueurs inscrits, compléter le N° d'équipe pour chaque joueur"]
[]
["- Colonne M : N° de l'équipe (en accord avec la liste des Equipes possibles)"]
[]
["c) Une fois les scores de tous les joueurs inscrits, lancer le tri en cliquant sur \"Tri des résultats de la manche x\""]
[]
[]
[]
[]
[]
[]
[]
[]
["Onglets Manche_x"]
[]
[]
["Ne pas trier les classements avant d'introduire les scores"]
["Les cellules des scores non remplies doivent être à 0"]
["(pour remplir plusieures cellules en 1 fois, sélectionner toutes les cellules voulues, presser sur zéro et pour valider presser sur Ctrl-Return)"]
[]
["Possibilité d'afficher jusqu'à  49 joueurs (actuellement les joueurs 36 à 54 sont masqués)"]
[]
[]
["En cas d'égalité entre plusieurs joueurs,  pour les \"départager\" selon les critères de l'art 4 :"]
["==> il faut ajouter . 01 (ou rien)  pour le moins bon et jusqu'à .07 pour le meilleur"]
[]
[]
["Pour la manche "]
[]
["a) Introduire les scores sur le classement individuel (Colonnes M5 à O58) en accord avec les membres (Qui)"]
["- Colonne M : Nom"]
["- Colonne N : Prénom"]
["- Colonne O : Score de la manche"]
[]
["b) Une fois les scores de tous les joueurs inscrits, lancer le tri en cliquant sur \"Tri des résultats de la manche1\""]
[]
[]
["Pour les manches suivantes"]
[]
["a) Lancer la préparation en cliquant sur \"Préparation de manche x\""]
[]
["b) Introduire les scores sur le classement individuel (Colonnes M5 à O58) - Ne pas trier les classements avant d'introduire les scores"]
["- Colonne M : Nom (si nouveau => à la suite des autres)"]
["- Colonne N : Prénom (si nouveau => à la suite des autres)"]
["- Colonne O : Score de la manche"]
[]
["c) Une fois les scores de tous les joueurs inscrits, lancer le tri en cliquant sur \"Tri des résultats de la manche x\""]
[]
[]
["NOTA BENE"]
["les colonnes représentant les manches 8 et 9 son masquées (K et L)"]
[]
["les lignes pour les joueurs > 35 sont masquées au max 54 (40 à 67)"]
["les lignes pour les clubs > 4 sont masquées (66 et 67)"]
[]
[]
[]
[]
[]
[]
[]
[]
[]
[]
[]
[]
[]
[]
[]
[]
[]
[]
[]
[]
[]
[]
[]
[]
[]
[]
[]
[]
[]
[]
[]
[]
[]
[]
[]
[]
[]
[]
[]
[]
[]
[]
[]
[]
[]
[]
[]
[]
[]
[null,null,null,null,null,"Duplicata Colonne A\ntechnique"]

{"sheet":"Manche_1","index":3,"n_rows":199,"n_cols":21,"rows_kept":199,"cut":false,"hidden":true,"merged":[[73,1,73,17],[0,0,0,17],[1,0,1,17],[2,0,2,1],[2,15,2,17],[3,15,3,17],[60,1,60,2],[60,15,60,16],[67,1,67,2],[68,12,68,17],[70,1,70,17],[71,1,71,17],[72,1,72,17]]}
["Association intercantonale \ndes joueurs de boules\nGrand Jeu Neuchâtelois"]
[{"$f":"CONCATENATE(\"Championnat grand jeu neuchâtelois \",YEAR(Calendrier!B6))","v":"Championnat grand jeu neuchâtelois 2020"}]
["Classement général individuel",null,"Manches",{"$f":"Calendrier!F40","v":"Le Locle"},{"$f":"Calendrier!F47","v":"Grand-Sommartel"},{"$f":"Calendrier!F54","v":"L'Epi"},{"$f":"Calendrier!F61","v":"La  Chaux-de-Fonds"},{"$f":"Calendrier!F68","v":"Evologia"},{"$f":"Calendrier!F75","v":"La  Vue-des-Alpes"},{"$f":"Calendrier!F82","v":"00:00:00"},null,null,{"$f":"CONCATENATE(\"Général\",CHAR(10),\"les \",Qui!$A$402,\" meilleurs\")","v":"Général\nles 5 meilleurs"},null,null,{"$f":"CONCATENATE(\"Classement de la manche\",CHAR(10),Calendrier!F40,CHAR(10),\"du\",TEXT(Calendrier!F42,\" jj.mm\"),\" au\",TEXT(Calendrier!F45,\" jj.mm.aaaa\"))","v":"Classement de la manche\nLe Locle\ndu 29.06 au 02.07.2020"},null,null,null,null,{"$f":"CONCATENATE(TEXT(Calendrier!F42,\" jj.mm\"),\" au\",TEXT(Calendrier!F45,\" jj.mm.aaaa\"))","v":" 29.06 au 02.07.2020"}]
[null,null,null,1,2,3,4,5,6,7,8,9,null,null,null,{"$f":"CONCATENATE(\"Champion de jeu : \",CHAR(10),P5,\" \",Q5)","v":"Champion de jeu : \nBart Fabien"}]
[1,"Bart","Fabien",0,0,0,0,0,0,0,null,null,{"$f":"SUM(D5:L5*(D5:L5>=LARGE(D5:L5,Qui!$A$402)))","v":0},{"$f":"IFERROR((VLOOKUP(CONCATENATE(B5,C5),Qui!$D$301:$F$356,3,)),0)","v":3},1,"Bart","Fabien",0,{"$f":"IFERROR((VLOOKUP(CONCATENATE(P5,Q5),Qui!$D$301:$F$356,3,0)),0)","v":3}]
[2,"Billod-Morel","Gérald",0,0,0,0,0,0,0,null,null,{"$f":"SUM(D6:L6*(D6:L6>=LARGE(D6:L6,Qui!$A$402)))","v":0},{"$f":"IFERROR((VLOOKUP(CONCATENATE(B6,C6),Qui!$D$301:$F$356,3,)),0)","v":1},2,"Billod-Morel","Gérald",0,{"$f":"IFERROR((VLOOKUP(CONCATENATE(P6,Q6),Qui!$D$301:$F$356,3,0)),0)","v":1}]
[3,"Bourquin","Willy",0,0,0,0,0,0,0,null,null,{"$f":"SUM(D7:L7*(D7:L7>=LARGE(D7:L7,Qui!$A$402)))","v":0},{"$f":"IFERROR((VLOOKUP(CONCATENATE(B7,C7),Qui!$D$301:$F$356,3,)),0)","v":4},3,"Bourquin","Willy",0,{"$f":"IFERROR((VLOOKUP(CONCATENATE(P7,Q7),Qui!$D$301:$F$356,3,0)),0)","v":4}]
[4,"Bühler","Raymond",0,0,0,0,0,0,0,null,null,{"$f":"SUM(D8:L8*(D8:L8>=LARGE(D8:L8,Qui!$A$402)))","v":0},{"$f":"IFERROR((VLOOKUP(CONCATENATE(B8,C8),Qui!$D$301:$F$356,3,)),0)","v":4},4,"Bühler","Raymond",0,{"$f":"IFERROR((VLOOKUP(CONCATENATE(P8,Q8),Qui!$D$301:$F$356,3,0)),0)","v":4}]
[5,"Cassi","Alain",0,0,0,0,0,0,0,null,null,{"$f":"SUM(D9:L9*(D9:L9>=LARGE(D9:L9,Qui!$A$402)))","v":0},{"$f":"IFERROR((VLOOKUP(CONCATENATE(B9,C9),Qui!$D$301:$F$356,3,)),0)","v":3},5,"Cassi","Alain",0,{"$f":"IFERROR((VLOOKUP(CONCATENATE(P9,Q9),Qui!$D$301:$F$356,3,0)),0)","v":3}]
[6,"Charlet","Léon",0,0,0,0,0,0,0,null,null,{"$f":"SUM(D10:L10*(D10:L10>=LARGE(D10:L10,Qui!$A$402)))","v":0},{"$f":"IFERROR((VLOOKUP(CONCATENATE(B10,C10),Qui!$D$301:$F$356,3,)),0)","v":2},6,"Charlet","Léon",0,{"$f":"IFERROR((VLOOKUP(CONCATENATE(P10,Q10),Qui!$D$301:$F$356,3,0)),0)","v":2}]
[7,"Chassot","Yves",0,0,0,0,0,0,0,null,null,{"$f":"SUM(D11:L11*(D11:L11>=LARGE(D11:L11,Qui!$A$402)))","v":0},{"$f":"IFERROR((VLOOKUP(CONCATENATE(B11,C11),Qui!$D$301:$F$356,3,)),0)","v":2},7,"Chassot","Yves",0,{"$f":"IFERROR((VLOOKUP(CONCATENATE(P11,Q11),Qui!$D$301:$F$356,3,0)),0)","v":2}]
[8,"Dick","Pierre-Alain",0,0,0,0,0,0,0,null,null,{"$f":"SUM(D12:L12*(D12:L12>=LARGE(D12:L12,Qui!$A$402)))","v":0},{"$f":"IFERROR((VLOOKUP(CONCATENATE(B12,C12),Qui!$D$301:$F$356,3,)),0)","v":2},8,"Dick","Pierre-Alain",0,{"$f":"IFERROR((VLOOKUP(CONCATENATE(P12,Q12),Qui!$D$301:$F$356,3,0)),0)","v":2}]
[9,"Dubois","Emmanuel",0,0,0,0,0,0,0,null,null,{"$f":"SUM(D13:L13*(D13:L13>=LARGE(D13:L13,Qui!$A$402)))","v":0},{"$f":"IFERROR((VLOOKUP(CONCATENATE(B13,C13),Qui!$D$301:$F$356,3,)),0)","v":1},9,"Dubois","Emmanuel",0,{"$f":"IFERROR((VLOOKUP(CONCATENATE(P13,Q13),Qui!$D$301:$F$356,3,0)),0)","v":1}]
[10,"Dubois","Eric",0,0,0,0,0,0,0,null,null,{"$f":"SUM(D14:L14*(D14:L14>=LARGE(D14:L14,Qui!$A$402)))","v":0},{"$f":"IFERROR((VLOOKUP(CONCATENATE(B14,C14),Qui!$D$301:$F$356,3,)),0)","v":1},10,"Dubois","Eric",0,{"$f":"IFERROR((VLOOKUP(CONCATENATE(P14,Q14),Qui!$D$301:$F$356,3,0)),0)","v":1}]
[11,"Dubois","Marcel",0,0,0,0,0,0,0,null,null,{"$f":"SUM(D15:L15*(D15:L15>=LARGE(D15:L15,Qui!$A$402)))","v":0},{"$f":"IFERROR((VLOOKUP(CONCATENATE(B15,C15),Qui!$D$301:$F$356,3,)),0)","v":1},11,"Dubois","Marcel",0,{"$f":"IFERROR((VLOOKUP(CONCATENATE(P15,Q15),Qui!$D$301:$F$356,3,0)),0)","v":1}]
[12,"Favre","Daniel",0,0,0,0,0,0,0,null,null,{"$f":"SUM(D16:L16*(D16:L16>=LARGE(D16:L16,Qui!$A$402)))","v":0},{"$f":"IFERROR((VLOOKUP(CONCATENATE(B16,C16),Qui!$D$301:$F$356,3,)),0)","v":3},12,"Favre","Daniel",0,{"$f":"IFERROR((VLOOKUP(CONCATENATE(P16,Q16),Qui!$D$301:$F$356,3,0)),0)","v":3}]
[13,"Frutiger","Bertrand",0,0,0,0,0,0,0,null,null,{"$f":"SUM(D17:L17*(D17:L17>=LARGE(D17:L17,Qui!$A$402)))","v":0},{"$f":"IFERROR((VLOOKUP(CONCATENATE(B17,C17),Qui!$D$301:$F$356,3,)),0)","v":4},13,"Frutiger","Bertrand",0,{"$f":"IFERROR((VLOOKUP(CONCATENATE(P17,Q17),Qui!$D$301:$F$356,3,0)),0)","v":4}]
[14,"Geiser","Willy",0,0,0,0,0,0,0,null,null,{"$f":"SUM(D18:L18*(D18:L18>=LARGE(D18:L18,Qui!$A$402)))","v":0},{"$f":"IFERROR((VLOOKUP(CONCATENATE(B18,C18),Qui!$D$301:$F$356,3,)),0)","v":1},14,"Geiser","Willy",0,{"$f":"IFERROR((VLOOKUP(CONCATENATE(P18,Q18),Qui!$D$301:$F$356,3,0)),0)","v":1}]
[15,"Gerber","Michel",0,0,0,0,0,0,0,null,null,{"$f":"SUM(D19:L19*(D19:L19>=LARGE(D19:L19,Qui!$A$402)))","v":0},{"$f":"IFERROR((VLOOKUP(CONCATENATE(B19,C19),Qui!$D$301:$F$356,3,)),0)","v":3},15,"Gerber","Michel",0,{"$f":"IFERROR((VLOOKUP(CONCATENATE(P19,Q19),Qui!$D$301:$F$356,3,0)),0)","v":3}]
[16,"Haussener","Philippe",0,0,0,0,0,0,0,null,null,{"$f":"SUM(D20:L20*(D20:L20>=LARGE(D20:L20,Qui!$A$402)))","v":0},{"$f":"IFERROR((VLOOKUP(CONCATENATE(B20,C20),Qui!$D$301:$F$356,3,)),0)","v":2},16,"Haussener","Philippe",0,{"$f":"IFERROR((VLOOKUP(CONCATENATE(P20,Q20),Qui!$D$301:$F$356,3,0)),0)","v":2}]
[17,"Jean-Mairet","Jean-Claude",0,0,0,0,0,0,0,null,null,{"$f":"SUM(D21:L21*(D21:L21>=LARGE(D21:L21,Qui!$A$402)))","v":0},{"$f":"IFERROR((VLOOKUP(CONCATENATE(B21,C21),Qui!$D$301:$F$356,3,)),0)","v":1},17,"Jean-Mairet","Jean-Claude",0,{"$f":"IFERROR((VLOOKUP(CONCATENATE(P21,Q21),Qui!$D$301:$F$356,3,0)),0)","v":1}]
[18,"Jeanneret","Louis",0,0,0,0,0,0,0,null,null,{"$f":"SUM(D22:L22*(D22:L22>=LARGE(D22:L22,Qui!$A$402)))","v":0},{"$f":"IFERROR((VLOOKUP(CONCATENATE(B22,C22),Qui!$D$301:$F$356,3,)),0)","v":2},18,"Jeanneret","Louis",0,{"$f":"IFERROR((VLOOKUP(CONCATENATE(P22,Q22),Qui!$D$301:$F$356,3,0)),0)","v":2}]
[19,"Kemajl","Fetahi",0,0,0,0,0,0,0,null,null,{"$f":"SUM(D23:L23*(D23:L23>=LARGE(D23:L23,Qui!$A$402)))","v":0},{"$f":"IFERROR((VLOOKUP(CONCATENATE(B23,C23),Qui!$D$301:$F$356,3,)),0)","v":3},19,"Kemajl","Fetahi",0,{"$f":"IFERROR((VLOOKUP(CONCATENATE(P23,Q23),Qui!$D$301:$F$356,3,0)),0)","v":3}]
[20,"Matthey","Pierre",0,0,0,0,0,0,0,null,null,{"$f":"SUM(D24:L24*(D24:L24>=LARGE(D24:L24,Qui!$A$402)))","v":0},{"$f":"IFERROR((VLOOKUP(CONCATENATE(B24,C24),Qui!$D$301:$F$356,3,)),0)","v":1},20,"Matthey","Pierre",0,{"$f":"IFERROR((VLOOKUP(CONCATENATE(P24,Q24),Qui!$D$301:$F$356,3,0)),0)","v":1}]
[21,"Monnier","Christian",0,0,0,0,0,0,0,null,null,{"$f":"SUM(D25:L25*(D25:L25>=LARGE(D25:L25,Qui!$A$402)))","v":0},{"$f":"IFERROR((VLOOKUP(CONCATENATE(B25,C25),Qui!$D$301:$F$356,3,)),0)","v":1},21,"Monnier","Christian",0,{"$f":"IFERROR((VLOOKUP(CONCATENATE(P25,Q25),Qui!$D$301:$F$356,3,0)),0)","v":1}]
[22,"Monnier","Marion",0,0,0,0,0,0,0,null,null,{"$f":"SUM(D26:L26*(D26:L26>=LARGE(D26:L26,Qui!$A$402)))","v":0},{"$f":"IFERROR((VLOOKUP(CONCATENATE(B26,C26),Qui!$D$301:$F$356,3,)),0)","v":1},22,"Monnier","Marion",0,{"$f":"IFERROR((VLOOKUP(CONCATENATE(P26,Q26),Qui!$D$301:$F$356,3,0)),0)","v":1}]
[23,"Mores","Blaise",0,0,0,0,0,0,0,null,null,{"$f":"SUM(D27:L27*(D27:L27>=LARGE(D27:L27,Qui!$A$402)))","v":0},{"$f":"IFERROR((VLOOKUP(CONCATENATE(B27,C27),Qui!$D$301:$F$356,3,)),0)","v":4},23,"Mores","Blaise",0,{"$f":"IFERROR((VLOOKUP(CONCATENATE(P27,Q27),Qui!$D$301:$F$356,3,0)),0)","v":4}]
[24,"Oppliger","Hervé",0,0,0,0,0,0,0,null,null,{"$f":"SUM(D28:L28*(D28:L28>=LARGE(D28:L28,Qui!$A$402)))","v":0},{"$f":"IFERROR((VLOOKUP(CONCATENATE(B28,C28),Qui!$D$301:$F$356,3,)),0)","v":2},24,"Oppliger","Hervé",0,{"$f":"IFERROR((VLOOKUP(CONCATENATE(P28,Q28),Qui!$D$301:$F$356,3,0)),0)","v":2}]
[25,"Pellaton","Daniel",0,0,0,0,0,0,0,null,null,{"$f":"SUM(D29:L29*(D29:L29>=LARGE(D29:L29,Qui!$A$402)))","v":0},{"$f":"IFERROR((VLOOKUP(CONCATENATE(B29,C29),Qui!$D$301:$F$356,3,)),0)","v":4},25,"Pellaton","Daniel",0,{"$f":"IFERROR((VLOOKUP(CONCATENATE(P29,Q29),Qui!$D$301:$F$356,3,0)),0)","v":4}]
[26,"Reichen","Sylvain",0,0,0,0,0,0,0,null,null,{"$f":"SUM(D30:L30*(D30:L30>=LARGE(D30:L30,Qui!$A$402)))","v":0},{"$f":"IFERROR((VLOOKUP(CONCATENATE(B30,C30),Qui!$D$301:$F$356,3,)),0)","v":4},26,"Reichen","Sylvain",0,{"$f":"IFERROR((VLOOKUP(CONCATENATE(P30,Q30),Qui!$D$301:$F$356,3,0)),0)","v":4}]
[27,"Rindlisbacher","Heinz",0,0,0,0,0,0,0,null,null,{"$f":"SUM(D31:L31*(D31:L31>=LARGE(D31:L31,Qui!$A$402)))","v":0},{"$f":"IFERROR((VLOOKUP(CONCATENATE(B31,C31),Qui!$D$301:$F$356,3,)),0)","v":4},27,"Rindlisbacher","Heinz",0,{"$f":"IFERROR((VLOOKUP(CONCATENATE(P31,Q31),Qui!$D$301:$F$356,3,0)),0)","v":4}]
[28,"Rollat","Christian",0,0,0,0,0,0,0,null,null,{"$f":"SUM(D32:L32*(D32:L32>=LARGE(D32:L32,Qui!$A$402)))","v":0},{"$f":"IFERROR((VLOOKUP(CONCATENATE(B32,C32),Qui!$D$301:$F$356,3,)),0)","v":1},28,"Rollat","Christian",0,{"$f":"IFERROR((VLOOKUP(CONCATENATE(P32,Q32),Qui!$D$301:$F$356,3,0)),0)","v":1}]
[29,"Rossier","Yves-Alain",0,0,0,0,0,0,0,null,null,{"$f":"SUM(D33:L33*(D33:L33>=LARGE(D33:L33,Qui!$A$402)))","v":0},{"$f":"IFERROR((VLOOKUP(CONCATENATE(B33,C33),Qui!$D$301:$F$356,3,)),0)","v":4},29,"Rossier","Yves-Alain",0,{"$f":"IFERROR((VLOOKUP(CONCATENATE(P33,Q33),Qui!$D$301:$F$356,3,0)),0)","v":4}]
[30,"Tinguely","Didier",0,0,0,0,0,0,0,null,null,{"$f":"SUM(D34:L34*(D34:L34>=LARGE(D34:L34,Qui!$A$402)))","v":0},{"$f":"IFERROR((VLOOKUP(CONCATENATE(B34,C34),Qui!$D$301:$F$356,3,)),0)","v":1},30,"Tinguely","Didier",0,{"$f":"IFERROR((VLOOKUP(CONCATENATE(P34,Q34),Qui!$D$301:$F$356,3,0)),0)","v":1}]
[31,"Tynowski","Lucien",0,0,0,0,0,0,0,null,null,{"$f":"SUM(D35:L35*(D35:L35>=LARGE(D35:L35,Qui!$A$402)))","v":0},{"$f":"IFERROR((VLOOKUP(CONCATENATE(B35,C35),Qui!$D$301:$F$356,3,)),0)","v":3},31,"Tynowski","Lucien",0,{"$f":"IFERROR((VLOOKUP(CONCATENATE(P35,Q35),Qui!$D$301:$F$356,3,0)),0)","v":3}]
[32,"Voirol","Pierre",0,0,0,0,0,0,0,null,null,{"$f":"SUM(D36:L36*(D36:L36>=LARGE(D36:L36,Qui!$A$402)))","v":0},{"$f":"IFERROR((VLOOKUP(CONCATENATE(B36,C36),Qui!$D$301:$F$356,3,)),0)","v":1},32,"Voirol","Pierre",0,{"$f":"IFERROR((VLOOKUP(CONCATENATE(P36,Q36),Qui!$D$301:$F$356,3,0)),0)","v":1}]
[33,"Vuillème","Claude-Alain",0,0,0,0,0,0,0,null,null,{"$f":"SUM(D37:L37*(D37:L37>=LARGE(D37:L37,Qui!$A$402)))","v":0},{"$f":"IFERROR((VLOOKUP(CONCATENATE(B37,C37),Qui!$D$301:$F$356,3,)),0)","v":2},33,"Vuillème","Claude-Alain",0,{"$f":"IFERROR((VLOOKUP(CONCATENATE(P37,Q37),Qui!$D$301:$F$356,3,0)),0)","v":2}]
[34,null,null,0,0,0,0,0,0,0,null,null,{"$f":"SUM(D38:L38*(D38:L38>=LARGE(D38:L38,Qui!$A$402)))","v":0},{"$f":"IFERROR((VLOOKUP(CONCATENATE(B38,C38),Qui!$D$301:$F$356,3,)),0)","v":0},34,null,null,0,{"$f":"IFERROR((VLOOKUP(CONCATENATE(P38,Q38),Qui!$D$301:$F$356,3,0)),0)","v":0}]
[35,null,null,0,0,0,0,0,0,0,null,null,{"$f":"SUM(D39:L39*(D39:L39>=LARGE(D39:L39,Qui!$A$402)))","v":0},{"$f":"IFERROR((VLOOKUP(CONCATENATE(B39,C39),Qui!$D$301:$F$356,3,)),0)","v":0},35,null,null,0,{"$f":"IFERROR((VLOOKUP(CONCATENATE(P39,Q39),Qui!$D$301:$F$356,3,0)),0)","v":0}]
[36,null,null,0,0,0,0,0,0,0,0,0,{"$f":"SUM(D40:L40*(D40:L40>=LARGE(D40:L40,Qui!$A$402)))","v":0},{"$f":"IFERROR((VLOOKUP(CONCATENATE(B40,C40),Qui!$D$301:$F$356,3,)),0)","v":0},36,null,null,0,{"$f":"IFERROR((VLOOKUP(CONCATENATE(P40,Q40),Qui!$D$301:$F$356,3,0)),0)","v":0}]
[37,null,null,0,0,0,0,0,0,0,0,0,{"$f":"SUM(D41:L41*(D41:L41>=LARGE(D41:L41,Qui!$A$402)))","v":0},{"$f":"IFERROR((VLOOKUP(CONCATENATE(B41,C41),Qui!$D$301:$F$356,3,)),0)","v":0},37,null,null,0,{"$f":"IFERROR((VLOOKUP(CONCATENATE(P41,Q41),Qui!$D$301:$F$356,3,0)),0)","v":0}]
[38,null,null,0,0,0,0,0,0,0,0,0,{"$f":"SUM(D42:L42*(D42:L42>=LARGE(D42:L42,Qui!$A$402)))","v":0},{"$f":"IFERROR((VLOOKUP(CONCATENATE(B42,C42),Qui!$D$301:$F$356,3,)),0)","v":0},38,null,null,0,{"$f":"IFERROR((VLOOKUP(CONCATENATE(P42,Q42),Qui!$D$301:$F$356,3,0)),0)","v":0}]
[39,null,null,0,0,0,0,0,0,0,0,0,{"$f":"SUM(D43:L43*(D43:L43>=LARGE(D43:L43,Qui!$A$402)))","v":0},{"$f":"IFERROR((VLOOKUP(CONCATENATE(B43,C43),Qui!$D$301:$F$356,3,)),0)","v":0},39,null,null,0,{"$f":"IFERROR((VLOOKUP(CONCATENATE(P43,Q43),Qui!$D$301:$F$356,3,0)),0)","v":0}]
[40,null,null,0,0,0,0,0,0,0,0,0,{"$f":"SUM(D44:L44*(D44:L44>=LARGE(D44:L44,Qui!$A$402)))","v":0},{"$f":"IFERROR((VLOOKUP(CONCATENATE(B44,C44),Qui!$D$301:$F$356,3,)),0)","v":0},40,null,null,0,{"$f":"IFERROR((VLOOKUP(CONCATENATE(P44,Q44),Qui!$D$301:$F$356,3,0)),0)","v":0}]
[41,null,null,0,0,0,0,0,0,0,0,0,{"$f":"SUM(D45:L45*(D45:L45>=LARGE(D45:L45,Qui!$A$402)))","v":0},{"$f":"IFERROR((VLOOKUP(CONCATENATE(B45,C45),Qui!$D$301:$F$356,3,)),0)","v":0},41,null,null,0,{"$f":"IFERROR((VLOOKUP(CONCATENATE(P45,Q45),Qui!$D$301:$F$356,3,0)),0)","v":0}]
[42,null,null,0,0,0,0,0,0,0,0,0,{"$f":"SUM(D46:L46*(D46:L46>=LARGE(D46:L46,Qui!$A$402)))","v":0},{"$f":"IFERROR((VLOOKUP(CONCATENATE(B46,C46),Qui!$D$301:$F$356,3,)),0)","v":0},42,null,null,0,{"$f":"IFERROR((VLOOKUP(CONCATENATE(P46,Q46),Qui!$D$301:$F$356,3,0)),0)","v":0}]
[43,null,null,0,0,0,0,0,0,0,0,0,{"$f":"SUM(D47:L47*(D47:L47>=LARGE(D47:L47,Qui!$A$402)))","v":0},{"$f":"IFERROR((VLOOKUP(CONCATENATE(B47,C47),Qui!$D$301:$F$356,3,)),0)","v":0},43,null,null,0,{"$f":"IFERROR((VLOOKUP(CONCATENATE(P47,Q47),Qui!$D$301:$F$356,3,0)),0)","v":0}]
[44,null,null,0,0,0,0,0,0,0,0,0,{"$f":"SUM(D48:L48*(D48:L48>=LARGE(D48:L48,Qui!$A$402)))","v":0},{"$f":"IFERROR((VLOOKUP(CONCATENATE(B48,C48),Qui!$D$301:$F$356,3,)),0)","v":0},44,null,null,0,{"$f":"IFERROR((VLOOKUP(CONCATENATE(P48,Q48),Qui!$D$301:$F$356,3,0)),0)","v":0}]
[45,null,null,0,0,0,0,0,0,0,0,0,{"$f":"SUM(D49:L49*(D49:L49>=LARGE(D49:L49,Qui!$A$402)))","v":0},{"$f":"IFERROR((VLOOKUP(CONCATENATE(B49,C49),Qui!$D$301:$F$356,3,)),0)","v":0},45,null,null,0,{"$f":"IFERROR((VLOOKUP(CONCATENATE(P49,Q49),Qui!$D$301:$F$356,3,0)),0)","v":0}]
[46,null,null,0,0,0,0,0,0,0,0,0,{"$f":"SUM(D50:L50*(D50:L50>=LARGE(D50:L50,Qui!$A$402)))","v":0},{"$f":"IFERROR((VLOOKUP(CONCATENATE(B50,C50),Qui!$D$301:$F$356,3,)),0)","v":0},46,null,null,0,{"$f":"IFERROR((VLOOKUP(CONCATENATE(P50,Q50),Qui!$D$301:$F$356,3,0)),0)","v":0}]
[47,null,null,0,0,0,0,0,0,0,0,0,{"$f":"SUM(D51:L51*(D51:L51>=LARGE(D51:L51,Qui!$A$402)))","v":0},{"$f":"IFERROR((VLOOKUP(CONCATENATE(B51,C51),Qui!$D$301:$F$356,3,)),0)","v":0},47,null,null,0,{"$f":"IFERROR((VLOOKUP(CONCATENATE(P51,Q51),Qui!$D$301:$F$356,3,0)),0)","v":0}]
[48,null,null,0,0,0,0,0,0,0,0,0,{"$f":"SUM(D52:L52*(D52:L52>=LARGE(D52:L52,Qui!$A$402)))","v":0},{"$f":"IFERROR((VLOOKUP(CONCATENATE(B52,C52),Qui!$D$301:$F$356,3,)),0)","v":0},48,null,null,0,{"$f":"IFERROR((VLOOKUP(CONCATENATE(P52,Q52),Qui!$D$301:$F$356,3,0)),0)","v":0}]
[49,null,null,0,0,0,0,0,0,0,0,0,{"$f":"SUM(D53:L53*(D53:L53>=LARGE(D53:L53,Qui!$A$402)))","v":0},{"$f":"IFERROR((VLOOKUP(CONCATENATE(B53,C53),Qui!$D$301:$F$356,3,)),0)","v":0},49,null,null,0,{"$f":"IFERROR((VLOOKUP(CONCATENATE(P53,Q53),Qui!$D$301:$F$356,3,0)),0)","v":0}]
[50,null,null,0,0,0,0,0,0,0,0,0,{"$f":"SUM(D54:L54*(D54:L54>=LARGE(D54:L54,Qui!$A$402)))","v":0},{"$f":"IFERROR((VLOOKUP(CONCATENATE(B54,C54),Qui!$D$301:$F$356,3,)),0)","v":0},50,null,null,0,{"$f":"IFERROR((VLOOKUP(CONCATENATE(P54,Q54),Qui!$D$301:$F$356,3,0)),0)","v":0}]
[51,null,null,0,0,0,0,0,0,0,0,0,{"$f":"SUM(D55:L55*(D55:L55>=LARGE(D55:L55,Qui!$A$402)))","v":0},{"$f":"IFERROR((VLOOKUP(CONCATENATE(B55,C55),Qui!$D$301:$F$356,3,)),0)","v":0},51,null,null,0,{"$f":"IFERROR((VLOOKUP(CONCATENATE(P55,Q55),Qui!$D$301:$F$356,3,0)),0)","v":0}]
[52,null,null,0,0,0,0,0,0,0,0,0,{"$f":"SUM(D56:L56*(D56:L56>=LARGE(D56:L56,Qui!$A$402)))","v":0},{"$f":"IFERROR((VLOOKUP(CONCATENATE(B56,C56),Qui!$D$301:$F$356,3,)),0)","v":0},52,null,null,0,{"$f":"IFERROR((VLOOKUP(CONCATENATE(P56,Q56),Qui!$D$301:$F$356,3,0)),0)","v":0}]
[53,null,null,0,0,0,0,0,0,0,0,0,{"$f":"SUM(D57:L57*(D57:L57>=LARGE(D57:L57,Qui!$A$402)))","v":0},{"$f":"IFERROR((VLOOKUP(CONCATENATE(B57,C57),Qui!$D$301:$F$356,3,)),0)","v":0},53,null,null,0,{"$f":"IFERROR((VLOOKUP(CONCATENATE(P57,Q57),Qui!$D$301:$F$356,3,0)),0)","v":0}]
[54,null,null,0,0,0,0,0,0,0,0,0,{"$f":"SUM(D58:L58*(D58:L58>=LARGE(D58:L58,Qui!$A$402)))","v":0},{"$f":"IFERROR((VLOOKUP(CONCATENATE(B58,C58),Qui!$D$301:$F$356,3,)),0)","v":0},54,null,null,0,{"$f":"IFERROR((VLOOKUP(CONCATENATE(P58,Q58),Qui!$D$301:$F$356,3,0)),0)","v":0}]
[null,null,null,{"$f":"MAX(D5:D58)","v":0},null,{"$f":"MAX(F5:F58)","v":0},{"$f":"MAX(G5:G58)","v":0},null,{"$f":"MAX(I5:I58)","v":0},{"$f":"MAX(J5:J58)","v":0},{"$f":"MAX(K5:K58)","v":0},{"$f":"MAX(L5:L58)","v":0}]
["Classement général par équipe",null,null,null,null,null,null,null,null,null,null,null,null,null,"Classement par équipe"]
[]
[1,"La Chaux-de-Fonds",null,0,null,null,null,null,null,null,null,null,{"$f":"SUM(D62:L62)","v":0},{"$f":"VLOOKUP(B62,Qui!$A$201:$D$204,4)","v":1},1,"La Chaux-de-Fonds",null,{"$f":"SUMPRODUCT(((($S$5:$S$58=S62)*$R$5:$R$58*1))*((($S$5:$S$58=S62)*$R$5:$R$58*1)>=LARGE((($S$5:$S$58=S62)*$R$5:$R$58*1),Qui!$B$402)))","v":0},{"$f":"VLOOKUP(P62,Qui!$A$201:$D$204,4)","v":1}]
[2,"L'Epi",null,0,null,null,null,null,null,null,null,null,{"$f":"SUM(D63:L63)","v":0},{"$f":"VLOOKUP(B63,Qui!$A$201:$D$204,4)","v":4},2,"L'Epi",null,{"$f":"SUMPRODUCT(((($S$5:$S$58=S63)*$R$5:$R$58*1))*((($S$5:$S$58=S63)*$R$5:$R$58*1)>=LARGE((($S$5:$S$58=S63)*$R$5:$R$58*1),Qui!$B$402)))","v":0},{"$f":"VLOOKUP(P63,Qui!$A$201:$D$204,4)","v":4}]
[3,"Le Locle",null,0,null,null,null,null,null,null,null,null,{"$f":"SUM(D64:L64)","v":0},{"$f":"VLOOKUP(B64,Qui!$A$201:$D$204,4)","v":3},3,"Le Locle",null,{"$f":"SUMPRODUCT(((($S$5:$S$58=S64)*$R$5:$R$58*1))*((($S$5:$S$58=S64)*$R$5:$R$58*1)>=LARGE((($S$5:$S$58=S64)*$R$5:$R$58*1),Qui!$B$402)))","v":0},{"$f":"VLOOKUP(P64,Qui!$A$201:$D$204,4)","v":3}]
[4,"La Vue-des-Alpes",null,0,null,null,null,null,null,null,null,null,{"$f":"SUM(D65:L65)","v":0},{"$f":"VLOOKUP(B65,Qui!$A$201:$D$204,4)","v":2},4,"La Vue-des-Alpes",null,{"$f":"SUMPRODUCT(((($S$5:$S$58=S65)*$R$5:$R$58*1))*((($S$5:$S$58=S65)*$R$5:$R$58*1)>=LARGE((($S$5:$S$58=S65)*$R$5:$R$58*1),Qui!$B$402)))","v":0},{"$f":"VLOOKUP(P65,Qui!$A$201:$D$204,4)","v":2}]
[5,null,null,{"$error":"#N/A"},null,null,null,null,null,null,null,null,{"$f":"SUM(D66:L66)","v":{"$error":"#N/A"}},{"$f":"VLOOKUP(B66,Qui!$A$201:$D$204,4)","v":{"$error":"#N/A"}},5,null,null,{"$f":"SUMPRODUCT(((($S$5:$S$58=S66)*$R$5:$R$58*1))*((($S$5:$S$58=S66)*$R$5:$R$58*1)>=LARGE((($S$5:$S$58=S66)*$R$5:$R$58*1),Qui!$B$402)))","v":{"$error":"#N/A"}},{"$f":"VLOOKUP(P66,Qui!$A$201:$D$204,4)","v":{"$error":"#N/A"}}]
[6,null,null,{"$error":"#N/A"},null,null,null,null,null,null,null,null,{"$error":"#N/A"},{"$f":"VLOOKUP(B67,Qui!$A$201:$D$204,4)","v":{"$error":"#N/A"}},6,null,null,{"$f":"SUMPRODUCT(((($S$5:$S$58=S67)*$R$5:$R$58*1))*((($S$5:$S$58=S67)*$R$5:$R$58*1)>=LARGE((($S$5:$S$58=S67)*$R$5:$R$58*1),Qui!$B$402)))","v":{"$error":"#N/A"}},{"$f":"VLOOKUP(P67,Qui!$A$201:$D$204,4)","v":{"$error":"#N/A"}}]
[null,null,null,{"$f":"MAX(D62:D67)","v":{"$error":"#N/A"}},null,{"$f":"MAX(F62:F67)","v":0},{"$f":"MAX(G62:G67)","v":0},null,{"$f":"MAX(I62:I67)","v":0},{"$f":"MAX(J62:J67)","v":0},{"$f":"MAX(K62:K67)","v":0},{"$f":"MAX(L62:L67)","v":0},null,null,null,null,null,0]
[null,null,null,null,null,null,null,null,null,null,null,null,"La Chaux-de-Fonds, le 2 septembre 2019, CM / DP"]
[]
[null,{"$f":"CONCATENATE(\"Rappels :\")","v":"Rappels :"}]
[]
[null,{"$f":"CONCATENATE(\"a) le classement général par équipe  est fait sur le cumul des \",Qui!$B$402,\" meilleurs résultats individuels de chaque manche\")","v":"a) le classement général par équipe  est fait sur le cumul des 5 meilleurs résultats individuels de chaque manche"}]
[null,{"$f":"CONCATENATE(\"b) le classement général individuel est fait sur le cumul des \",Qui!$A$402,\" meilleurs résultats individuels\")","v":"b) le classement général individuel est fait sur le cumul des 5 meilleurs résultats individuels"}]
[]
[]
[]
[]
[]
[]
[]
[]
[]
[]
[]
[]
[]
[]
[]
[]
[]
[]
[]
[]
[]
[]
[]
[]
[]
[]
[]
[]
[]
[]
[]
[]
[]
[]
[]
[]
[]
[]
[]
[]
[]
[]
[]
[]
[]
[]
[]
[]
[]
[]
[]
[]
[]
[]
[]
[]
[]
[]
[]
[]
[]
[]
[]
[]
[]
[]
[]
[]
[]
[]
[]
[]
[]
[]
[]
[]
[]
[]
[]
[]
[]
[]
[]
[]
[]
[]
[]
[]
[]
[]
[]
[]
[]
[]
[]
[]
[]
[]
[]
[]
[]
[]
[]
[]
[]
[]
[]
[]
[]
[]
[]
[]
[]
[]
[]
[]
[]
[]
[]
[]
[]
[]
[]
[]
[null,null,null,null,null,"Duplicata Colonne A\ntechnique"]

{"sheet":"Manche_2","index":4,"n_rows":199,"n_cols":21,"rows_kept":199,"cut":false,"hidden":true,"merged":[[73,1,73,17],[0,0,0,17],[1,0,1,17],[2,0,2,1],[2,15,2,17],[3,15,3,17],[60,1,60,2],[60,15,60,16],[67,1,67,2],[68,12,68,17],[70,1,70,17],[71,1,71,17],[72,1,72,17]]}
["Association intercantonale \ndes joueurs de boules\nGrand Jeu Neuchâtelois"]
[{"$f":"CONCATENATE(\"Championnat grand jeu neuchâtelois \",YEAR(Calendrier!B6))","v":"Championnat grand jeu neuchâtelois 2020"}]
["Classement général individuel",null,"Manches",{"$f":"Calendrier!F40","v":"Le Locle"},{"$f":"Calendrier!F47","v":"Grand-Sommartel"},{"$f":"Calendrier!F54","v":"L'Epi"},{"$f":"Calendrier!F61","v":"La  Chaux-de-Fonds"},{"$f":"Calendrier!F68","v":"Evologia"},{"$f":"Calendrier!F75","v":"La  Vue-des-Alpes"},{"$f":"Calendrier!F82","v":"00:00:00"},null,null,{"$f":"CONCATENATE(\"Général\",CHAR(10),\"les \",Qui!$A$402,\" meilleurs\")","v":"Général\nles 5 meilleurs"},null,null,{"$f":"CONCATENATE(\"Classement de la manche\",CHAR(10),Calendrier!F47,CHAR(10),\"du\",TEXT(Calendrier!F49,\" jj.mm\"),\" au\",TEXT(Calendrier!F52,\" jj.mm.aaaa\"))","v":"Classement de la manche\nGrand-Sommartel\ndu 24.08 au 27.08.2020"},null,null,null,null,{"$f":"CONCATENATE(TEXT(Calendrier!F49,\" jj.mm\"),\" au\",TEXT(Calendrier!F52,\" jj.mm.aaaa\"))","v":" 24.08 au 27.08.2020"}]
[null,null,null,1,2,3,4,5,6,7,8,9,null,null,null,{"$f":"CONCATENATE(\"Champion de jeu : \",CHAR(10),P5,\" \",Q5)","v":"Champion de jeu : \n "}]
[1,null,null,null,null,null,null,null,null,null,null,null,{"$f":"SUM(D5:L5*(D5:L5>=LARGE(D5:L5,Qui!$A$402)))","v":{"$error":"#NUM!"}},{"$f":"IFERROR((VLOOKUP(CONCATENATE(B5,C5),Qui!$D$301:$F$356,3,)),0)","v":0},1,null,null,0,{"$f":"IFERROR((VLOOKUP(CONCATENATE(P5,Q5),Qui!$D$301:$F$356,3,0)),0)","v":0}]
[2,null,null,null,null,null,null,null,null,null,null,null,{"$f":"SUM(D6:L6*(D6:L6>=LARGE(D6:L6,Qui!$A$402)))","v":{"$error":"#NUM!"}},{"$f":"IFERROR((VLOOKUP(CONCATENATE(B6,C6),Qui!$D$301:$F$356,3,)),0)","v":0},2,null,null,0,{"$f":"IFERROR((VLOOKUP(CONCATENATE(P6,Q6),Qui!$D$301:$F$356,3,0)),0)","v":0}]
[3,null,null,null,null,null,null,null,null,null,null,null,{"$f":"SUM(D7:L7*(D7:L7>=LARGE(D7:L7,Qui!$A$402)))","v":{"$error":"#NUM!"}},{"$f":"IFERROR((VLOOKUP(CONCATENATE(B7,C7),Qui!$D$301:$F$356,3,)),0)","v":0},3,null,null,0,{"$f":"IFERROR((VLOOKUP(CONCATENATE(P7,Q7),Qui!$D$301:$F$356,3,0)),0)","v":0}]
[4,null,null,null,null,null,null,null,null,null,null,null,{"$f":"SUM(D8:L8*(D8:L8>=LARGE(D8:L8,Qui!$A$402)))","v":{"$error":"#NUM!"}},{"$f":"IFERROR((VLOOKUP(CONCATENATE(B8,C8),Qui!$D$301:$F$356,3,)),0)","v":0},4,null,null,0,{"$f":"IFERROR((VLOOKUP(CONCATENATE(P8,Q8),Qui!$D$301:$F$356,3,0)),0)","v":0}]
[5,null,null,null,null,null,null,null,null,null,null,null,{"$f":"SUM(D9:L9*(D9:L9>=LARGE(D9:L9,Qui!$A$402)))","v":{"$error":"#NUM!"}},{"$f":"IFERROR((VLOOKUP(CONCATENATE(B9,C9),Qui!$D$301:$F$356,3,)),0)","v":0},5,null,null,0,{"$f":"IFERROR((VLOOKUP(CONCATENATE(P9,Q9),Qui!$D$301:$F$356,3,0)),0)","v":0}]
[6,null,null,null,null,null,null,null,null,null,null,null,{"$f":"SUM(D10:L10*(D10:L10>=LARGE(D10:L10,Qui!$A$402)))","v":{"$error":"#NUM!"}},{"$f":"IFERROR((VLOOKUP(CONCATENATE(B10,C10),Qui!$D$301:$F$356,3,)),0)","v":0},6,null,null,0,{"$f":"IFERROR((VLOOKUP(CONCATENATE(P10,Q10),Qui!$D$301:$F$356,3,0)),0)","v":0}]
[7,null,null,null,null,null,null,null,null,null,null,null,{"$f":"SUM(D11:L11*(D11:L11>=LARGE(D11:L11,Qui!$A$402)))","v":{"$error":"#NUM!"}},{"$f":"IFERROR((VLOOKUP(CONCATENATE(B11,C11),Qui!$D$301:$F$356,3,)),0)","v":0},7,null,null,0,{"$f":"IFERROR((VLOOKUP(CONCATENATE(P11,Q11),Qui!$D$301:$F$356,3,0)),0)","v":0}]
[8,null,null,null,null,null,null,null,null,null,null,null,{"$f":"SUM(D12:L12*(D12:L12>=LARGE(D12:L12,Qui!$A$402)))","v":{"$error":"#NUM!"}},{"$f":"IFERROR((VLOOKUP(CONCATENATE(B12,C12),Qui!$D$301:$F$356,3,)),0)","v":0},8,null,null,0,{"$f":"IFERROR((VLOOKUP(CONCATENATE(P12,Q12),Qui!$D$301:$F$356,3,0)),0)","v":0}]
[9,null,null,null,null,null,null,null,null,null,null,null,{"$f":"SUM(D13:L13*(D13:L13>=LARGE(D13:L13,Qui!$A$402)))","v":{"$error":"#NUM!"}},{"$f":"IFERROR((VLOOKUP(CONCATENATE(B13,C13),Qui!$D$301:$F$356,3,)),0)","v":0},9,null,null,0,{"$f":"IFERROR((VLOOKUP(CONCATENATE(P13,Q13),Qui!$D$301:$F$356,3,0)),0)","v":0}]
[10,null,null,null,null,null,null,null,null,null,null,null,{"$f":"SUM(D14:L14*(D14:L14>=LARGE(D14:L14,Qui!$A$402)))","v":{"$error":"#NUM!"}},{"$f":"IFERROR((VLOOKUP(CONCATENATE(B14,C14),Qui!$D$301:$F$356,3,)),0)","v":0},10,null,null,0,{"$f":"IFERROR((VLOOKUP(CONCATENATE(P14,Q14),Qui!$D$301:$F$356,3,0)),0)","v":0}]
[11,null,null,null,null,null,null,null,null,null,null,null,{"$f":"SUM(D15:L15*(D15:L15>=LARGE(D15:L15,Qui!$A$402)))","v":{"$error":"#NUM!"}},{"$f":"IFERROR((VLOOKUP(CONCATENATE(B15,C15),Qui!$D$301:$F$356,3,)),0)","v":0},11,null,null,0,{"$f":"IFERROR((VLOOKUP(CONCATENATE(P15,Q15),Qui!$D$301:$F$356,3,0)),0)","v":0}]
[12,null,null,null,null,null,null,null,null,null,null,null,{"$f":"SUM(D16:L16*(D16:L16>=LARGE(D16:L16,Qui!$A$402)))","v":{"$error":"#NUM!"}},{"$f":"IFERROR((VLOOKUP(CONCATENATE(B16,C16),Qui!$D$301:$F$356,3,)),0)","v":0},12,null,null,0,{"$f":"IFERROR((VLOOKUP(CONCATENATE(P16,Q16),Qui!$D$301:$F$356,3,0)),0)","v":0}]
[13,null,null,null,null,null,null,null,null,null,null,null,{"$f":"SUM(D17:L17*(D17:L17>=LARGE(D17:L17,Qui!$A$402)))","v":{"$error":"#NUM!"}},{"$f":"IFERROR((VLOOKUP(CONCATENATE(B17,C17),Qui!$D$301:$F$356,3,)),0)","v":0},13,null,null,0,{"$f":"IFERROR((VLOOKUP(CONCATENATE(P17,Q17),Qui!$D$301:$F$356,3,0)),0)","v":0}]
[14,null,null,null,null,null,null,null,null,null,null,null,{"$f":"SUM(D18:L18*(D18:L18>=LARGE(D18:L18,Qui!$A$402)))","v":{"$error":"#NUM!"}},{"$f":"IFERROR((VLOOKUP(CONCATENATE(B18,C18),Qui!$D$301:$F$356,3,)),0)","v":0},14,null,null,0,{"$f":"IFERROR((VLOOKUP(CONCATENATE(P18,Q18),Qui!$D$301:$F$356,3,0)),0)","v":0}]
[15,null,null,null,null,null,null,null,null,null,null,null,{"$f":"SUM(D19:L19*(D19:L19>=LARGE(D19:L19,Qui!$A$402)))","v":{"$error":"#NUM!"}},{"$f":"IFERROR((VLOOKUP(CONCATENATE(B19,C19),Qui!$D$301:$F$356,3,)),0)","v":0},15,null,null,0,{"$f":"IFERROR((VLOOKUP(CONCATENATE(P19,Q19),Qui!$D$301:$F$356,3,0)),0)","v":0}]
[16,null,null,null,null,null,null,null,null,null,null,null,{"$f":"SUM(D20:L20*(D20:L20>=LARGE(D20:L20,Qui!$A$402)))","v":{"$error":"#NUM!"}},{"$f":"IFERROR((VLOOKUP(CONCATENATE(B20,C20),Qui!$D$301:$F$356,3,)),0)","v":0},16,null,null,0,{"$f":"IFERROR((VLOOKUP(CONCATENATE(P20,Q20),Qui!$D$301:$F$356,3,0)),0)","v":0}]
[17,null,null,null,null,null,null,null,null,null,null,null,{"$f":"SUM(D21:L21*(D21:L21>=LARGE(D21:L21,Qui!$A$402)))","v":{"$error":"#NUM!"}},{"$f":"IFERROR((VLOOKUP(CONCATENATE(B21,C21),Qui!$D$301:$F$356,3,)),0)","v":0},17,null,null,0,{"$f":"IFERROR((VLOOKUP(CONCATENATE(P21,Q21),Qui!$D$301:$F$356,3,0)),0)","v":0}]
[18,null,null,null,null,null,null,null,null,null,null,null,{"$f":"SUM(D22:L22*(D22:L22>=LARGE(D22:L22,Qui!$A$402)))","v":{"$error":"#NUM!"}},{"$f":"IFERROR((VLOOKUP(CONCATENATE(B22,C22),Qui!$D$301:$F$356,3,)),0)","v":0},18,null,null,0,{"$f":"IFERROR((VLOOKUP(CONCATENATE(P22,Q22),Qui!$D$301:$F$356,3,0)),0)","v":0}]
[19,null,null,null,null,null,null,null,null,null,null,null,{"$f":"SUM(D23:L23*(D23:L23>=LARGE(D23:L23,Qui!$A$402)))","v":{"$error":"#NUM!"}},{"$f":"IFERROR((VLOOKUP(CONCATENATE(B23,C23),Qui!$D$301:$F$356,3,)),0)","v":0},19,null,null,0,{"$f":"IFERROR((VLOOKUP(CONCATENATE(P23,Q23),Qui!$D$301:$F$356,3,0)),0)","v":0}]
[20,null,null,null,null,null,null,null,null,null,null,null,{"$f":"SUM(D24:L24*(D24:L24>=LARGE(D24:L24,Qui!$A$402)))","v":{"$error":"#NUM!"}},{"$f":"IFERROR((VLOOKUP(CONCATENATE(B24,C24),Qui!$D$301:$F$356,3,)),0)","v":0},20,null,null,0,{"$f":"IFERROR((VLOOKUP(CONCATENATE(P24,Q24),Qui!$D$301:$F$356,3,0)),0)","v":0}]
[21,null,null,null,null,null,null,null,null,null,null,null,{"$f":"SUM(D25:L25*(D25:L25>=LARGE(D25:L25,Qui!$A$402)))","v":{"$error":"#NUM!"}},{"$f":"IFERROR((VLOOKUP(CONCATENATE(B25,C25),Qui!$D$301:$F$356,3,)),0)","v":0},21,null,null,0,{"$f":"IFERROR((VLOOKUP(CONCATENATE(P25,Q25),Qui!$D$301:$F$356,3,0)),0)","v":0}]
[22,null,null,null,null,null,null,null,null,null,null,null,{"$f":"SUM(D26:L26*(D26:L26>=LARGE(D26:L26,Qui!$A$402)))","v":{"$error":"#NUM!"}},{"$f":"IFERROR((VLOOKUP(CONCATENATE(B26,C26),Qui!$D$301:$F$356,3,)),0)","v":0},22,null,null,0,{"$f":"IFERROR((VLOOKUP(CONCATENATE(P26,Q26),Qui!$D$301:$F$356,3,0)),0)","v":0}]
[23,null,null,null,null,null,null,null,null,null,null,null,{"$f":"SUM(D27:L27*(D27:L27>=LARGE(D27:L27,Qui!$A$402)))","v":{"$error":"#NUM!"}},{"$f":"IFERROR((VLOOKUP(CONCATENATE(B27,C27),Qui!$D$301:$F$356,3,)),0)","v":0},23,null,null,0,{"$f":"IFERROR((VLOOKUP(CONCATENATE(P27,Q27),Qui!$D$301:$F$356,3,0)),0)","v":0}]
[24,null,null,null,null,null,null,null,null,null,null,null,{"$f":"SUM(D28:L28*(D28:L28>=LARGE(D28:L28,Qui!$A$402)))","v":{"$error":"#NUM!"}},{"$f":"IFERROR((VLOOKUP(CONCATENATE(B28,C28),Qui!$D$301:$F$356,3,)),0)","v":0},24,null,null,0,{"$f":"IFERROR((VLOOKUP(CONCATENATE(P28,Q28),Qui!$D$301:$F$356,3,0)),0)","v":0}]
[25,null,null,null,null,null,null,null,null,null,null,null,{"$f":"SUM(D29:L29*(D29:L29>=LARGE(D29:L29,Qui!$A$402)))","v":{"$error":"#NUM!"}},{"$f":"IFERROR((VLOOKUP(CONCATENATE(B29,C29),Qui!$D$301:$F$356,3,)),0)","v":0},25,null,null,0,{"$f":"IFERROR((VLOOKUP(CONCATENATE(P29,Q29),Qui!$D$301:$F$356,3,0)),0)","v":0}]
[26,null,null,null,null,null,null,null,null,null,null,null,{"$f":"SUM(D30:L30*(D30:L30>=LARGE(D30:L30,Qui!$A$402)))","v":{"$error":"#NUM!"}},{"$f":"IFERROR((VLOOKUP(CONCATENATE(B30,C30),Qui!$D$301:$F$356,3,)),0)","v":0},26,null,null,0,{"$f":"IFERROR((VLOOKUP(CONCATENATE(P30,Q30),Qui!$D$301:$F$356,3,0)),0)","v":0}]
[27,null,null,null,null,null,null,null,null,null,null,null,{"$f":"SUM(D31:L31*(D31:L31>=LARGE(D31:L31,Qui!$A$402)))","v":{"$error":"#NUM!"}},{"$f":"IFERROR((VLOOKUP(CONCATENATE(B31,C31),Qui!$D$301:$F$356,3,)),0)","v":0},27,null,null,0,{"$f":"IFERROR((VLOOKUP(CONCATENATE(P31,Q31),Qui!$D$301:$F$356,3,0)),0)","v":0}]
[28,null,null,null,null,null,null,null,null,null,null,null,{"$f":"SUM(D32:L32*(D32:L32>=LARGE(D32:L32,Qui!$A$402)))","v":{"$error":"#NUM!"}},{"$f":"IFERROR((VLOOKUP(CONCATENATE(B32,C32),Qui!$D$301:$F$356,3,)),0)","v":0},28,null,null,0,{"$f":"IFERROR((VLOOKUP(CONCATENATE(P32,Q32),Qui!$D$301:$F$356,3,0)),0)","v":0}]
[29,null,null,null,null,null,null,null,null,null,null,null,{"$f":"SUM(D33:L33*(D33:L33>=LARGE(D33:L33,Qui!$A$402)))","v":{"$error":"#NUM!"}},{"$f":"IFERROR((VLOOKUP(CONCATENATE(B33,C33),Qui!$D$301:$F$356,3,)),0)","v":0},29,null,null,0,{"$f":"IFERROR((VLOOKUP(CONCATENATE(P33,Q33),Qui!$D$301:$F$356,3,0)),0)","v":0}]
[30,null,null,null,null,null,null,null,null,null,null,null,{"$f":"SUM(D34:L34*(D34:L34>=LARGE(D34:L34,Qui!$A$402)))","v":{"$error":"#NUM!"}},{"$f":"IFERROR((VLOOKUP(CONCATENATE(B34,C34),Qui!$D$301:$F$356,3,)),0)","v":0},30,null,null,0,{"$f":"IFERROR((VLOOKUP(CONCATENATE(P34,Q34),Qui!$D$301:$F$356,3,0)),0)","v":0}]
[31,null,null,null,null,null,null,null,null,null,null,null,{"$f":"SUM(D35:L35*(D35:L35>=LARGE(D35:L35,Qui!$A$402)))","v":{"$error":"#NUM!"}},{"$f":"IFERROR((VLOOKUP(CONCATENATE(B35,C35),Qui!$D$301:$F$356,3,)),0)","v":0},31,null,null,0,{"$f":"IFERROR((VLOOKUP(CONCATENATE(P35,Q35),Qui!$D$301:$F$356,3,0)),0)","v":0}]
[32,null,null,null,null,null,null,null,null,null,null,null,{"$f":"SUM(D36:L36*(D36:L36>=LARGE(D36:L36,Qui!$A$402)))","v":{"$error":"#NUM!"}},{"$f":"IFERROR((VLOOKUP(CONCATENATE(B36,C36),Qui!$D$301:$F$356,3,)),0)","v":0},32,null,null,0,{"$f":"IFERROR((VLOOKUP(CONCATENATE(P36,Q36),Qui!$D$301:$F$356,3,0)),0)","v":0}]
[33,null,null,null,null,null,null,null,null,null,null,null,{"$f":"SUM(D37:L37*(D37:L37>=LARGE(D37:L37,Qui!$A$402)))","v":{"$error":"#NUM!"}},{"$f":"IFERROR((VLOOKUP(CONCATENATE(B37,C37),Qui!$D$301:$F$356,3,)),0)","v":0},33,null,null,0,{"$f":"IFERROR((VLOOKUP(CONCATENATE(P37,Q37),Qui!$D$301:$F$356,3,0)),0)","v":0}]
[34,null,null,null,null,null,null,null,null,null,null,null,{"$f":"SUM(D38:L38*(D38:L38>=LARGE(D38:L38,Qui!$A$402)))","v":{"$error":"#NUM!"}},{"$f":"IFERROR((VLOOKUP(CONCATENATE(B38,C38),Qui!$D$301:$F$356,3,)),0)","v":0},34,null,null,0,{"$f":"IFERROR((VLOOKUP(CONCATENATE(P38,Q38),Qui!$D$301:$F$356,3,0)),0)","v":0}]
[35,null,null,null,null,null,null,null,null,null,null,null,{"$f":"SUM(D39:L39*(D39:L39>=LARGE(D39:L39,Qui!$A$402)))","v":{"$error":"#NUM!"}},{"$f":"IFERROR((VLOOKUP(CONCATENATE(B39,C39),Qui!$D$301:$F$356,3,)),0)","v":0},35,null,null,0,{"$f":"IFERROR((VLOOKUP(CONCATENATE(P39,Q39),Qui!$D$301:$F$356,3,0)),0)","v":0}]
[36,null,null,0,0,0,0,0,0,0,0,0,{"$f":"SUM(D40:L40*(D40:L40>=LARGE(D40:L40,Qui!$A$402)))","v":0},{"$f":"IFERROR((VLOOKUP(CONCATENATE(B40,C40),Qui!$D$301:$F$356,3,)),0)","v":0},36,null,null,0,{"$f":"IFERROR((VLOOKUP(CONCATENATE(P40,Q40),Qui!$D$301:$F$356,3,0)),0)","v":0}]
[37,null,null,0,0,0,0,0,0,0,0,0,{"$f":"SUM(D41:L41*(D41:L41>=LARGE(D41:L41,Qui!$A$402)))","v":0},{"$f":"IFERROR((VLOOKUP(CONCATENATE(B41,C41),Qui!$D$301:$F$356,3,)),0)","v":0},37,null,null,0,{"$f":"IFERROR((VLOOKUP(CONCATENATE(P41,Q41),Qui!$D$301:$F$356,3,0)),0)","v":0}]
[38,null,null,0,0,0,0,0,0,0,0,0,{"$f":"SUM(D42:L42*(D42:L42>=LARGE(D42:L42,Qui!$A$402)))","v":0},{"$f":"IFERROR((VLOOKUP(CONCATENATE(B42,C42),Qui!$D$301:$F$356,3,)),0)","v":0},38,null,null,0,{"$f":"IFERROR((VLOOKUP(CONCATENATE(P42,Q42),Qui!$D$301:$F$356,3,0)),0)","v":0}]
[39,null,null,0,0,0,0,0,0,0,0,0,{"$f":"SUM(D43:L43*(D43:L43>=LARGE(D43:L43,Qui!$A$402)))","v":0},{"$f":"IFERROR((VLOOKUP(CONCATENATE(B43,C43),Qui!$D$301:$F$356,3,)),0)","v":0},39,null,null,0,{"$f":"IFERROR((VLOOKUP(CONCATENATE(P43,Q43),Qui!$D$301:$F$356,3,0)),0)","v":0}]
[40,null,null,0,0,0,0,0,0,0,0,0,{"$f":"SUM(D44:L44*(D44:L44>=LARGE(D44:L44,Qui!$A$402)))","v":0},{"$f":"IFERROR((VLOOKUP(CONCATENATE(B44,C44),Qui!$D$301:$F$356,3,)),0)","v":0},40,null,null,0,{"$f":"IFERROR((VLOOKUP(CONCATENATE(P44,Q44),Qui!$D$301:$F$356,3,0)),0)","v":0}]
[41,null,null,0,0,0,0,0,0,0,0,0,{"$f":"SUM(D45:L45*(D45:L45>=LARGE(D45:L45,Qui!$A$402)))","v":0},{"$f":"IFERROR((VLOOKUP(CONCATENATE(B45,C45),Qui!$D$301:$F$356,3,)),0)","v":0},41,null,null,0,{"$f":"IFERROR((VLOOKUP(CONCATENATE(P45,Q45),Qui!$D$301:$F$356,3,0)),0)","v":0}]
[42,null,null,0,0,0,0,0,0,0,0,0,{"$f":"SUM(D46:L46*(D46:L46>=LARGE(D46:L46,Qui!$A$402)))","v":0},{"$f":"IFERROR((VLOOKUP(CONCATENATE(B46,C46),Qui!$D$301:$F$356,3,)),0)","v":0},42,null,null,0,{"$f":"IFERROR((VLOOKUP(CONCATENATE(P46,Q46),Qui!$D$301:$F$356,3,0)),0)","v":0}]
[43,null,null,0,0,0,0,0,0,0,0,0,{"$f":"SUM(D47:L47*(D47:L47>=LARGE(D47:L47,Qui!$A$402)))","v":0},{"$f":"IFERROR((VLOOKUP(CONCATENATE(B47,C47),Qui!$D$301:$F$356,3,)),0)","v":0},43,null,null,0,{"$f":"IFERROR((VLOOKUP(CONCATENATE(P47,Q47),Qui!$D$301:$F$356,3,0)),0)","v":0}]
[44,null,null,0,0,0,0,0,0,0,0,0,{"$f":"SUM(D48:L48*(D48:L48>=LARGE(D48:L48,Qui!$A$402)))","v":0},{"$f":"IFERROR((VLOOKUP(CONCATENATE(B48,C48),Qui!$D$301:$F$356,3,)),0)","v":0},44,null,null,0,{"$f":"IFERROR((VLOOKUP(CONCATENATE(P48,Q48),Qui!$D$301:$F$356,3,0)),0)","v":0}]
[45,null,null,0,0,0,0,0,0,0,0,0,{"$f":"SUM(D49:L49*(D49:L49>=LARGE(D49:L49,Qui!$A$402)))","v":0},{"$f":"IFERROR((VLOOKUP(CONCATENATE(B49,C49),Qui!$D$301:$F$356,3,)),0)","v":0},45,null,null,0,{"$f":"IFERROR((VLOOKUP(CONCATENATE(P49,Q49),Qui!$D$301:$F$356,3,0)),0)","v":0}]
[46,null,null,0,0,0,0,0,0,0,0,0,{"$f":"SUM(D50:L50*(D50:L50>=LARGE(D50:L50,Qui!$A$402)))","v":0},{"$f":"IFERROR((VLOOKUP(CONCATENATE(B50,C50),Qui!$D$301:$F$356,3,)),0)","v":0},46,null,null,0,{"$f":"IFERROR((VLOOKUP(CONCATENATE(P50,Q50),Qui!$D$301:$F$356,3,0)),0)","v":0}]
[47,null,null,0,0,0,0,0,0,0,0,0,{"$f":"SUM(D51:L51*(D51:L51>=LARGE(D51:L51,Qui!$A$402)))","v":0},{"$f":"IFERROR((VLOOKUP(CONCATENATE(B51,C51),Qui!$D$301:$F$356,3,)),0)","v":0},47,null,null,0,{"$f":"IFERROR((VLOOKUP(CONCATENATE(P51,Q51),Qui!$D$301:$F$356,3,0)),0)","v":0}]
[48,null,null,0,0,0,0,0,0,0,0,0,{"$f":"SUM(D52:L52*(D52:L52>=LARGE(D52:L52,Qui!$A$402)))","v":0},{"$f":"IFERROR((VLOOKUP(CONCATENATE(B52,C52),Qui!$D$301:$F$356,3,)),0)","v":0},48,null,null,0,{"$f":"IFERROR((VLOOKUP(CONCATENATE(P52,Q52),Qui!$D$301:$F$356,3,0)),0)","v":0}]
[49,null,null,0,0,0,0,0,0,0,0,0,{"$f":"SUM(D53:L53*(D53:L53>=LARGE(D53:L53,Qui!$A$402)))","v":0},{"$f":"IFERROR((VLOOKUP(CONCATENATE(B53,C53),Qui!$D$301:$F$356,3,)),0)","v":0},49,null,null,0,{"$f":"IFERROR((VLOOKUP(CONCATENATE(P53,Q53),Qui!$D$301:$F$356,3,0)),0)","v":0}]
[50,null,null,0,0,0,0,0,0,0,0,0,{"$f":"SUM(D54:L54*(D54:L54>=LARGE(D54:L54,Qui!$A$402)))","v":0},{"$f":"IFERROR((VLOOKUP(CONCATENATE(B54,C54),Qui!$D$301:$F$356,3,)),0)","v":0},50,null,null,0,{"$f":"IFERROR((VLOOKUP(CONCATENATE(P54,Q54),Qui!$D$301:$F$356,3,0)),0)","v":0}]
[51,null,null,0,0,0,0,0,0,0,0,0,{"$f":"SUM(D55:L55*(D55:L55>=LARGE(D55:L55,Qui!$A$402)))","v":0},{"$f":"IFERROR((VLOOKUP(CONCATENATE(B55,C55),Qui!$D$301:$F$356,3,)),0)","v":0},51,null,null,0,{"$f":"IFERROR((VLOOKUP(CONCATENATE(P55,Q55),Qui!$D$301:$F$356,3,0)),0)","v":0}]
[52,null,null,0,0,0,0,0,0,0,0,0,{"$f":"SUM(D56:L56*(D56:L56>=LARGE(D56:L56,Qui!$A$402)))","v":0},{"$f":"IFERROR((VLOOKUP(CONCATENATE(B56,C56),Qui!$D$301:$F$356,3,)),0)","v":0},52,null,null,0,{"$f":"IFERROR((VLOOKUP(CONCATENATE(P56,Q56),Qui!$D$301:$F$356,3,0)),0)","v":0}]
[53,null,null,0,0,0,0,0,0,0,0,0,{"$f":"SUM(D57:L57*(D57:L57>=LARGE(D57:L57,Qui!$A$402)))","v":0},{"$f":"IFERROR((VLOOKUP(CONCATENATE(B57,C57),Qui!$D$301:$F$356,3,)),0)","v":0},53,null,null,0,{"$f":"IFERROR((VLOOKUP(CONCATENATE(P57,Q57),Qui!$D$301:$F$356,3,0)),0)","v":0}]
[54,null,null,0,0,0,0,0,0,0,0,0,{"$f":"SUM(D58:L58*(D58:L58>=LARGE(D58:L58,Qui!$A$402)))","v":0},{"$f":"IFERROR((VLOOKUP(CONCATENATE(B58,C58),Qui!$D$301:$F$356,3,)),0)","v":0},54,null,null,0,{"$f":"IFERROR((VLOOKUP(CONCATENATE(P58,Q58),Qui!$D$301:$F$356,3,0)),0)","v":0}]
[null,null,null,{"$f":"MAX(D5:D58)","v":0},null,{"$f":"MAX(F5:F58)","v":0},{"$f":"MAX(G5:G58)","v":0},null,{"$f":"MAX(I5:I58)","v":0},{"$f":"MAX(J5:J58)","v":0},{"$f":"MAX(K5:K58)","v":0},{"$f":"MAX(L5:L58)","v":0}]
["Classement général par équipe",null,null,null,null,null,null,null,null,null,null,null,null,null,"Classement par équipe"]
[]
[1,null,null,null,null,null,null,null,null,null,null,null,{"$f":"SUM(D62:L62)","v":0},{"$f":"VLOOKUP(B62,Qui!$A$201:$D$204,4)","v":{"$error":"#N/A"}},1,null,null,0,{"$f":"VLOOKUP(P62,Qui!$A$201:$D$204,4)","v":{"$error":"#N/A"}}]
[2,null,null,null,null,null,null,null,null,null,null,null,{"$f":"SUM(D63:L63)","v":0},{"$f":"VLOOKUP(B63,Qui!$A$201:$D$204,4)","v":{"$error":"#N/A"}},2,null,null,0,{"$f":"VLOOKUP(P63,Qui!$A$201:$D$204,4)","v":{"$error":"#N/A"}}]
[3,null,null,null,null,null,null,null,null,null,null,null,{"$f":"SUM(D64:L64)","v":0},{"$f":"VLOOKUP(B64,Qui!$A$201:$D$204,4)","v":{"$error":"#N/A"}},3,null,null,0,{"$f":"VLOOKUP(P64,Qui!$A$201:$D$204,4)","v":{"$error":"#N/A"}}]
[4,null,null,null,null,null,null,null,null,null,null,null,{"$f":"SUM(D65:L65)","v":0},{"$f":"VLOOKUP(B65,Qui!$A$201:$D$204,4)","v":{"$error":"#N/A"}},4,null,null,0,{"$f":"VLOOKUP(P65,Qui!$A$201:$D$204,4)","v":{"$error":"#N/A"}}]
[5,null,null,{"$error":"#N/A"},435,null,null,null,null,null,null,null,null,null,5,null,null,435,{"$f":"VLOOKUP(P66,Qui!$A$201:$D$204,4)","v":{"$error":"#N/A"}}]
[6,null,null,{"$error":"#N/A"},435,null,null,null,null,null,null,null,null,null,6,null,null,435,{"$f":"VLOOKUP(P67,Qui!$A$201:$D$204,4)","v":{"$error":"#N/A"}}]
[null,null,null,{"$f":"MAX(D62:D67)","v":{"$error":"#N/A"}},null,{"$f":"MAX(F62:F67)","v":0},{"$f":"MAX(G62:G67)","v":0},null,{"$f":"MAX(I62:I67)","v":0},{"$f":"MAX(J62:J67)","v":0},{"$f":"MAX(K62:K67)","v":0},{"$f":"MAX(L62:L67)","v":0},null,null,null,null,null,0]
[null,null,null,null,null,null,null,null,null,null,null,null,"La Chaux-de-Fonds, le 17 septembre 2019, CM / DP"]
[]
[null,{"$f":"CONCATENATE(\"Rappels :\")","v":"Rappels :"}]
[]
[null,{"$f":"CONCATENATE(\"a) le classement général par équipe  est fait sur le cumul des \",Qui!$B$402,\" meilleurs résultats individuels de chaque manche\")","v":"a) le classement général par équipe  est fait sur le cumul des 5 meilleurs résultats individuels de chaque manche"}]
[null,{"$f":"CONCATENATE(\"b) le classement général individuel est fait sur le cumul des \",Qui!$A$402,\" meilleurs résultats individuels\")","v":"b) le classement général individuel est fait sur le cumul des 5 meilleurs résultats individuels"}]
[]
[]
[]
[]
[]
[]
[]
[]
[]
[]
[]
[]
[]
[]
[]
[]
[]
[]
[]
[]
[]
[]
[]
[]
[]
[]
[]
[]
[]
[]
[]
[]
[]
[]
[]
[]
[]
[]
[]
[]
[]
[]
[]
[]
[]
[]
[]
[]
[]
[]
[]
[]
[]
[]
[]
[]
[]
[]
[]
[]
[]
[]
[]
[]
[]
[]
[]
[]
[]
[]
[]
[]
[]
[]
[]
[]
[]
[]
[]
[]
[]
[]
[]
[]
[]
[]
[]
[]
[]
[]
[]
[]
[]
[]
[]
[]
[]
[]
[]
[]
[]
[]
[]
[]
[]
[]
[]
[]
[]
[]
[]
[]
[]
[]
[]
[]
[]
[]
[]
[]
[]
[]
[]
[]
[null,null,null,null,null,"Duplicata Colonne A\ntechnique"]

{"sheet":"Manche_3","index":5,"n_rows":199,"n_cols":21,"rows_kept":199,"cut":false,"hidden":true,"merged":[[73,1,73,17],[0,0,0,17],[1,0,1,17],[2,0,2,1],[2,15,2,17],[3,15,3,17],[60,1,60,2],[60,15,60,16],[67,1,67,2],[68,12,68,17],[70,1,70,17],[71,1,71,17],[72,1,72,17]]}
["Association intercantonale \ndes joueurs de boules\nGrand Jeu Neuchâtelois"]
[{"$f":"CONCATENATE(\"Championnat grand jeu neuchâtelois \",YEAR(Calendrier!B6))","v":"Championnat grand jeu neuchâtelois 2020"}]
["Classement général individuel",null,"Manches",{"$f":"Calendrier!F40","v":"Le Locle"},{"$f":"Calendrier!F47","v":"Grand-Sommartel"},{"$f":"Calendrier!F54","v":"L'Epi"},{"$f":"Calendrier!F61","v":"La  Chaux-de-Fonds"},{"$f":"Calendrier!F68","v":"Evologia"},{"$f":"Calendrier!F75","v":"La  Vue-des-Alpes"},{"$f":"Calendrier!F82","v":"00:00:00"},null,null,{"$f":"CONCATENATE(\"Général\",CHAR(10),\"les \",Qui!$A$402,\" meilleurs\")","v":"Général\nles 5 meilleurs"},null,null,{"$f":"CONCATENATE(\"Classement de la manche\",CHAR(10),Calendrier!F54,CHAR(10),\"du\",TEXT(Calendrier!F56,\" jj.mm\"),\" au\",TEXT(Calendrier!F59,\" jj.mm.aaaa\"))","v":"Classement de la manche\nL'Epi\ndu 07.09 au 10.09.2020"},null,null,null,null,{"$f":"CONCATENATE(TEXT(Calendrier!F56,\" jj.mm\"),\" au\",TEXT(Calendrier!F59,\" jj.mm.aaaa\"))","v":" 07.09 au 10.09.2020"}]
[null,null,null,1,2,3,4,5,6,7,8,9,null,null,null,{"$f":"CONCATENATE(\"Champion de jeu : \",CHAR(10),P5,\" \",Q5)","v":"Champion de jeu : \n "}]
[1,null,null,null,null,null,null,null,null,null,null,null,{"$f":"SUM(D5:L5*(D5:L5>=LARGE(D5:L5,Qui!$A$402)))","v":{"$error":"#NUM!"}},{"$f":"IFERROR((VLOOKUP(CONCATENATE(B5,C5),Qui!$D$301:$F$356,3,)),0)","v":0},1,null,null,0,{"$f":"IFERROR((VLOOKUP(CONCATENATE(P5,Q5),Qui!$D$301:$F$356,3,0)),0)","v":0}]
[2,null,null,null,null,null,null,null,null,null,null,null,{"$f":"SUM(D6:L6*(D6:L6>=LARGE(D6:L6,Qui!$A$402)))","v":{"$error":"#NUM!"}},{"$f":"IFERROR((VLOOKUP(CONCATENATE(B6,C6),Qui!$D$301:$F$356,3,)),0)","v":0},2,null,null,0,{"$f":"IFERROR((VLOOKUP(CONCATENATE(P6,Q6),Qui!$D$301:$F$356,3,0)),0)","v":0}]
[3,null,null,null,null,null,null,null,null,null,null,null,{"$f":"SUM(D7:L7*(D7:L7>=LARGE(D7:L7,Qui!$A$402)))","v":{"$error":"#NUM!"}},{"$f":"IFERROR((VLOOKUP(CONCATENATE(B7,C7),Qui!$D$301:$F$356,3,)),0)","v":0},3,null,null,0,{"$f":"IFERROR((VLOOKUP(CONCATENATE(P7,Q7),Qui!$D$301:$F$356,3,0)),0)","v":0}]
[4,null,null,null,null,null,null,null,null,null,null,null,{"$f":"SUM(D8:L8*(D8:L8>=LARGE(D8:L8,Qui!$A$402)))","v":{"$error":"#NUM!"}},{"$f":"IFERROR((VLOOKUP(CONCATENATE(B8,C8),Qui!$D$301:$F$356,3,)),0)","v":0},4,null,null,0,{"$f":"IFERROR((VLOOKUP(CONCATENATE(P8,Q8),Qui!$D$301:$F$356,3,0)),0)","v":0}]
[5,null,null,null,null,null,null,null,null,null,null,null,{"$f":"SUM(D9:L9*(D9:L9>=LARGE(D9:L9,Qui!$A$402)))","v":{"$error":"#NUM!"}},{"$f":"IFERROR((VLOOKUP(CONCATENATE(B9,C9),Qui!$D$301:$F$356,3,)),0)","v":0},5,null,null,0,{"$f":"IFERROR((VLOOKUP(CONCATENATE(P9,Q9),Qui!$D$301:$F$356,3,0)),0)","v":0}]
[6,null,null,null,null,null,null,null,null,null,null,null,{"$f":"SUM(D10:L10*(D10:L10>=LARGE(D10:L10,Qui!$A$402)))","v":{"$error":"#NUM!"}},{"$f":"IFERROR((VLOOKUP(CONCATENATE(B10,C10),Qui!$D$301:$F$356,3,)),0)","v":0},6,null,null,0,{"$f":"IFERROR((VLOOKUP(CONCATENATE(P10,Q10),Qui!$D$301:$F$356,3,0)),0)","v":0}]
[7,null,null,null,null,null,null,null,null,null,null,null,{"$f":"SUM(D11:L11*(D11:L11>=LARGE(D11:L11,Qui!$A$402)))","v":{"$error":"#NUM!"}},{"$f":"IFERROR((VLOOKUP(CONCATENATE(B11,C11),Qui!$D$301:$F$356,3,)),0)","v":0},7,null,null,0,{"$f":"IFERROR((VLOOKUP(CONCATENATE(P11,Q11),Qui!$D$301:$F$356,3,0)),0)","v":0}]
[8,null,null,null,null,null,null,null,null,null,null,null,{"$f":"SUM(D12:L12*(D12:L12>=LARGE(D12:L12,Qui!$A$402)))","v":{"$error":"#NUM!"}},{"$f":"IFERROR((VLOOKUP(CONCATENATE(B12,C12),Qui!$D$301:$F$356,3,)),0)","v":0},8,null,null,0,{"$f":"IFERROR((VLOOKUP(CONCATENATE(P12,Q12),Qui!$D$301:$F$356,3,0)),0)","v":0}]
[9,null,null,null,null,null,null,null,null,null,null,null,{"$f":"SUM(D13:L13*(D13:L13>=LARGE(D13:L13,Qui!$A$402)))","v":{"$error":"#NUM!"}},{"$f":"IFERROR((VLOOKUP(CONCATENATE(B13,C13),Qui!$D$301:$F$356,3,)),0)","v":0},9,null,null,0,{"$f":"IFERROR((VLOOKUP(CONCATENATE(P13,Q13),Qui!$D$301:$F$356,3,0)),0)","v":0}]
[10,null,null,null,null,null,null,null,null,null,null,null,{"$f":"SUM(D14:L14*(D14:L14>=LARGE(D14:L14,Qui!$A$402)))","v":{"$error":"#NUM!"}},{"$f":"IFERROR((VLOOKUP(CONCATENATE(B14,C14),Qui!$D$301:$F$356,3,)),0)","v":0},10,null,null,0,{"$f":"IFERROR((VLOOKUP(CONCATENATE(P14,Q14),Qui!$D$301:$F$356,3,0)),0)","v":0}]
[11,null,null,null,null,null,null,null,null,null,null,null,{"$f":"SUM(D15:L15*(D15:L15>=LARGE(D15:L15,Qui!$A$402)))","v":{"$error":"#NUM!"}},{"$f":"IFERROR((VLOOKUP(CONCATENATE(B15,C15),Qui!$D$301:$F$356,3,)),0)","v":0},11,null,null,0,{"$f":"IFERROR((VLOOKUP(CONCATENATE(P15,Q15),Qui!$D$301:$F$356,3,0)),0)","v":0}]
[12,null,null,null,null,null,null,null,null,null,null,null,{"$f":"SUM(D16:L16*(D16:L16>=LARGE(D16:L16,Qui!$A$402)))","v":{"$error":"#NUM!"}},{"$f":"IFERROR((VLOOKUP(CONCATENATE(B16,C16),Qui!$D$301:$F$356,3,)),0)","v":0},12,null,null,0,{"$f":"IFERROR((VLOOKUP(CONCATENATE(P16,Q16),Qui!$D$301:$F$356,3,0)),0)","v":0}]
[13,null,null,null,null,null,null,null,null,null,null,null,{"$f":"SUM(D17:L17*(D17:L17>=LARGE(D17:L17,Qui!$A$402)))","v":{"$error":"#NUM!"}},{"$f":"IFERROR((VLOOKUP(CONCATENATE(B17,C17),Qui!$D$301:$F$356,3,)),0)","v":0},13,null,null,0,{"$f":"IFERROR((VLOOKUP(CONCATENATE(P17,Q17),Qui!$D$301:$F$356,3,0)),0)","v":0}]
[14,null,null,null,null,null,null,null,null,null,null,null,{"$f":"SUM(D18:L18*(D18:L18>=LARGE(D18:L18,Qui!$A$402)))","v":{"$error":"#NUM!"}},{"$f":"IFERROR((VLOOKUP(CONCATENATE(B18,C18),Qui!$D$301:$F$356,3,)),0)","v":0},14,null,null,0,{"$f":"IFERROR((VLOOKUP(CONCATENATE(P18,Q18),Qui!$D$301:$F$356,3,0)),0)","v":0}]
[15,null,null,null,null,null,null,null,null,null,null,null,{"$f":"SUM(D19:L19*(D19:L19>=LARGE(D19:L19,Qui!$A$402)))","v":{"$error":"#NUM!"}},{"$f":"IFERROR((VLOOKUP(CONCATENATE(B19,C19),Qui!$D$301:$F$356,3,)),0)","v":0},15,null,null,0,{"$f":"IFERROR((VLOOKUP(CONCATENATE(P19,Q19),Qui!$D$301:$F$356,3,0)),0)","v":0}]
[16,null,null,null,null,null,null,null,null,null,null,null,{"$f":"SUM(D20:L20*(D20:L20>=LARGE(D20:L20,Qui!$A$402)))","v":{"$error":"#NUM!"}},{"$f":"IFERROR((VLOOKUP(CONCATENATE(B20,C20),Qui!$D$301:$F$356,3,)),0)","v":0},16,null,null,0,{"$f":"IFERROR((VLOOKUP(CONCATENATE(P20,Q20),Qui!$D$301:$F$356,3,0)),0)","v":0}]
[17,null,null,null,null,null,null,null,null,null,null,null,{"$f":"SUM(D21:L21*(D21:L21>=LARGE(D21:L21,Qui!$A$402)))","v":{"$error":"#NUM!"}},{"$f":"IFERROR((VLOOKUP(CONCATENATE(B21,C21),Qui!$D$301:$F$356,3,)),0)","v":0},17,null,null,0,{"$f":"IFERROR((VLOOKUP(CONCATENATE(P21,Q21),Qui!$D$301:$F$356,3,0)),0)","v":0}]
[18,null,null,null,null,null,null,null,null,null,null,null,{"$f":"SUM(D22:L22*(D22:L22>=LARGE(D22:L22,Qui!$A$402)))","v":{"$error":"#NUM!"}},{"$f":"IFERROR((VLOOKUP(CONCATENATE(B22,C22),Qui!$D$301:$F$356,3,)),0)","v":0},18,null,null,0,{"$f":"IFERROR((VLOOKUP(CONCATENATE(P22,Q22),Qui!$D$301:$F$356,3,0)),0)","v":0}]
[19,null,null,null,null,null,null,null,null,null,null,null,{"$f":"SUM(D23:L23*(D23:L23>=LARGE(D23:L23,Qui!$A$402)))","v":{"$error":"#NUM!"}},{"$f":"IFERROR((VLOOKUP(CONCATENATE(B23,C23),Qui!$D$301:$F$356,3,)),0)","v":0},19,null,null,0,{"$f":"IFERROR((VLOOKUP(CONCATENATE(P23,Q23),Qui!$D$301:$F$356,3,0)),0)","v":0}]
[20,null,null,null,null,null,null,null,null,null,null,null,{"$f":"SUM(D24:L24*(D24:L24>=LARGE(D24:L24,Qui!$A$402)))","v":{"$error":"#NUM!"}},{"$f":"IFERROR((VLOOKUP(CONCATENATE(B24,C24),Qui!$D$301:$F$356,3,)),0)","v":0},20,null,null,0,{"$f":"IFERROR((VLOOKUP(CONCATENATE(P24,Q24),Qui!$D$301:$F$356,3,0)),0)","v":0}]
[21,null,null,null,null,null,null,null,null,null,null,null,{"$f":"SUM(D25:L25*(D25:L25>=LARGE(D25:L25,Qui!$A$402)))","v":{"$error":"#NUM!"}},{"$f":"IFERROR((VLOOKUP(CONCATENATE(B25,C25),Qui!$D$301:$F$356,3,)),0)","v":0},21,null,null,0,{"$f":"IFERROR((VLOOKUP(CONCATENATE(P25,Q25),Qui!$D$301:$F$356,3,0)),0)","v":0}]
[22,null,null,null,null,null,null,null,null,null,null,null,{"$f":"SUM(D26:L26*(D26:L26>=LARGE(D26:L26,Qui!$A$402)))","v":{"$error":"#NUM!"}},{"$f":"IFERROR((VLOOKUP(CONCATENATE(B26,C26),Qui!$D$301:$F$356,3,)),0)","v":0},22,null,null,0,{"$f":"IFERROR((VLOOKUP(CONCATENATE(P26,Q26),Qui!$D$301:$F$356,3,0)),0)","v":0}]
[23,null,null,null,null,null,null,null,null,null,null,null,{"$f":"SUM(D27:L27*(D27:L27>=LARGE(D27:L27,Qui!$A$402)))","v":{"$error":"#NUM!"}},{"$f":"IFERROR((VLOOKUP(CONCATENATE(B27,C27),Qui!$D$301:$F$356,3,)),0)","v":0},23,null,null,0,{"$f":"IFERROR((VLOOKUP(CONCATENATE(P27,Q27),Qui!$D$301:$F$356,3,0)),0)","v":0}]
[24,null,null,null,null,null,null,null,null,null,null,null,{"$f":"SUM(D28:L28*(D28:L28>=LARGE(D28:L28,Qui!$A$402)))","v":{"$error":"#NUM!"}},{"$f":"IFERROR((VLOOKUP(CONCATENATE(B28,C28),Qui!$D$301:$F$356,3,)),0)","v":0},24,null,null,0,{"$f":"IFERROR((VLOOKUP(CONCATENATE(P28,Q28),Qui!$D$301:$F$356,3,0)),0)","v":0}]
[25,null,null,null,null,null,null,null,null,null,null,null,{"$f":"SUM(D29:L29*(D29:L29>=LARGE(D29:L29,Qui!$A$402)))","v":{"$error":"#NUM!"}},{"$f":"IFERROR((VLOOKUP(CONCATENATE(B29,C29),Qui!$D$301:$F$356,3,)),0)","v":0},25,null,null,0,{"$f":"IFERROR((VLOOKUP(CONCATENATE(P29,Q29),Qui!$D$301:$F$356,3,0)),0)","v":0}]
[26,null,null,null,null,null,null,null,null,null,null,null,{"$f":"SUM(D30:L30*(D30:L30>=LARGE(D30:L30,Qui!$A$402)))","v":{"$error":"#NUM!"}},{"$f":"IFERROR((VLOOKUP(CONCATENATE(B30,C30),Qui!$D$301:$F$356,3,)),0)","v":0},26,null,null,0,{"$f":"IFERROR((VLOOKUP(CONCATENATE(P30,Q30),Qui!$D$301:$F$356,3,0)),0)","v":0}]
[27,null,null,null,null,null,null,null,null,null,null,null,{"$f":"SUM(D31:L31*(D31:L31>=LARGE(D31:L31,Qui!$A$402)))","v":{"$error":"#NUM!"}},{"$f":"IFERROR((VLOOKUP(CONCATENATE(B31,C31),Qui!$D$301:$F$356,3,)),0)","v":0},27,null,null,0,{"$f":"IFERROR((VLOOKUP(CONCATENATE(P31,Q31),Qui!$D$301:$F$356,3,0)),0)","v":0}]
[28,null,null,null,null,null,null,null,null,null,null,null,{"$f":"SUM(D32:L32*(D32:L32>=LARGE(D32:L32,Qui!$A$402)))","v":{"$error":"#NUM!"}},{"$f":"IFERROR((VLOOKUP(CONCATENATE(B32,C32),Qui!$D$301:$F$356,3,)),0)","v":0},28,null,null,0,{"$f":"IFERROR((VLOOKUP(CONCATENATE(P32,Q32),Qui!$D$301:$F$356,3,0)),0)","v":0}]
[29,null,null,null,null,null,null,null,null,null,null,null,{"$f":"SUM(D33:L33*(D33:L33>=LARGE(D33:L33,Qui!$A$402)))","v":{"$error":"#NUM!"}},{"$f":"IFERROR((VLOOKUP(CONCATENATE(B33,C33),Qui!$D$301:$F$356,3,)),0)","v":0},29,null,null,0,{"$f":"IFERROR((VLOOKUP(CONCATENATE(P33,Q33),Qui!$D$301:$F$356,3,0)),0)","v":0}]
[30,null,null,null,null,null,null,null,null,null,null,null,{"$f":"SUM(D34:L34*(D34:L34>=LARGE(D34:L34,Qui!$A$402)))","v":{"$error":"#NUM!"}},{"$f":"IFERROR((VLOOKUP(CONCATENATE(B34,C34),Qui!$D$301:$F$356,3,)),0)","v":0},30,null,null,0,{"$f":"IFERROR((VLOOKUP(CONCATENATE(P34,Q34),Qui!$D$301:$F$356,3,0)),0)","v":0}]
[31,null,null,null,null,null,null,null,null,null,null,null,{"$f":"SUM(D35:L35*(D35:L35>=LARGE(D35:L35,Qui!$A$402)))","v":{"$error":"#NUM!"}},{"$f":"IFERROR((VLOOKUP(CONCATENATE(B35,C35),Qui!$D$301:$F$356,3,)),0)","v":0},31,null,null,0,{"$f":"IFERROR((VLOOKUP(CONCATENATE(P35,Q35),Qui!$D$301:$F$356,3,0)),0)","v":0}]
[32,null,null,null,null,null,null,null,null,null,null,null,{"$f":"SUM(D36:L36*(D36:L36>=LARGE(D36:L36,Qui!$A$402)))","v":{"$error":"#NUM!"}},{"$f":"IFERROR((VLOOKUP(CONCATENATE(B36,C36),Qui!$D$301:$F$356,3,)),0)","v":0},32,null,null,0,{"$f":"IFERROR((VLOOKUP(CONCATENATE(P36,Q36),Qui!$D$301:$F$356,3,0)),0)","v":0}]
[33,null,null,null,null,null,null,null,null,null,null,null,{"$f":"SUM(D37:L37*(D37:L37>=LARGE(D37:L37,Qui!$A$402)))","v":{"$error":"#NUM!"}},{"$f":"IFERROR((VLOOKUP(CONCATENATE(B37,C37),Qui!$D$301:$F$356,3,)),0)","v":0},33,null,null,0,{"$f":"IFERROR((VLOOKUP(CONCATENATE(P37,Q37),Qui!$D$301:$F$356,3,0)),0)","v":0}]
[34,null,null,null,null,null,null,null,null,null,null,null,{"$f":"SUM(D38:L38*(D38:L38>=LARGE(D38:L38,Qui!$A$402)))","v":{"$error":"#NUM!"}},{"$f":"IFERROR((VLOOKUP(CONCATENATE(B38,C38),Qui!$D$301:$F$356,3,)),0)","v":0},34,null,null,0,{"$f":"IFERROR((VLOOKUP(CONCATENATE(P38,Q38),Qui!$D$301:$F$356,3,0)),0)","v":0}]
[35,null,null,null,null,null,null,null,null,null,null,null,{"$f":"SUM(D39:L39*(D39:L39>=LARGE(D39:L39,Qui!$A$402)))","v":{"$error":"#NUM!"}},{"$f":"IFERROR((VLOOKUP(CONCATENATE(B39,C39),Qui!$D$301:$F$356,3,)),0)","v":0},35,null,null,0,{"$f":"IFERROR((VLOOKUP(CONCATENATE(P39,Q39),Qui!$D$301:$F$356,3,0)),0)","v":0}]
[36,null,null,0,0,0,0,0,0,0,0,0,{"$f":"SUM(D40:L40*(D40:L40>=LARGE(D40:L40,Qui!$A$402)))","v":0},{"$f":"IFERROR((VLOOKUP(CONCATENATE(B40,C40),Qui!$D$301:$F$356,3,)),0)","v":0},36,null,null,0,{"$f":"IFERROR((VLOOKUP(CONCATENATE(P40,Q40),Qui!$D$301:$F$356,3,0)),0)","v":0}]
[37,null,null,0,0,0,0,0,0,0,0,0,{"$f":"SUM(D41:L41*(D41:L41>=LARGE(D41:L41,Qui!$A$402)))","v":0},{"$f":"IFERROR((VLOOKUP(CONCATENATE(B41,C41),Qui!$D$301:$F$356,3,)),0)","v":0},37,null,null,0,{"$f":"IFERROR((VLOOKUP(CONCATENATE(P41,Q41),Qui!$D$301:$F$356,3,0)),0)","v":0}]
[38,null,null,0,0,0,0,0,0,0,0,0,{"$f":"SUM(D42:L42*(D42:L42>=LARGE(D42:L42,Qui!$A$402)))","v":0},{"$f":"IFERROR((VLOOKUP(CONCATENATE(B42,C42),Qui!$D$301:$F$356,3,)),0)","v":0},38,null,null,0,{"$f":"IFERROR((VLOOKUP(CONCATENATE(P42,Q42),Qui!$D$301:$F$356,3,0)),0)","v":0}]
[39,null,null,0,0,0,0,0,0,0,0,0,{"$f":"SUM(D43:L43*(D43:L43>=LARGE(D43:L43,Qui!$A$402)))","v":0},{"$f":"IFERROR((VLOOKUP(CONCATENATE(B43,C43),Qui!$D$301:$F$356,3,)),0)","v":0},39,null,null,0,{"$f":"IFERROR((VLOOKUP(CONCATENATE(P43,Q43),Qui!$D$301:$F$356,3,0)),0)","v":0}]
[40,null,null,0,0,0,0,0,0,0,0,0,{"$f":"SUM(D44:L44*(D44:L44>=LARGE(D44:L44,Qui!$A$402)))","v":0},{"$f":"IFERROR((VLOOKUP(CONCATENATE(B44,C44),Qui!$D$301:$F$356,3,)),0)","v":0},40,null,null,0,{"$f":"IFERROR((VLOOKUP(CONCATENATE(P44,Q44),Qui!$D$301:$F$356,3,0)),0)","v":0}]
[41,null,null,0,0,0,0,0,0,0,0,0,{"$f":"SUM(D45:L45*(D45:L45>=LARGE(D45:L45,Qui!$A$402)))","v":0},{"$f":"IFERROR((VLOOKUP(CONCATENATE(B45,C45),Qui!$D$301:$F$356,3,)),0)","v":0},41,null,null,0,{"$f":"IFERROR((VLOOKUP(CONCATENATE(P45,Q45),Qui!$D$301:$F$356,3,0)),0)","v":0}]
[42,null,null,0,0,0,0,0,0,0,0,0,{"$f":"SUM(D46:L46*(D46:L46>=LARGE(D46:L46,Qui!$A$402)))","v":0},{"$f":"IFERROR((VLOOKUP(CONCATENATE(B46,C46),Qui!$D$301:$F$356,3,)),0)","v":0},42,null,null,0,{"$f":"IFERROR((VLOOKUP(CONCATENATE(P46,Q46),Qui!$D$301:$F$356,3,0)),0)","v":0}]
[43,null,null,0,0,0,0,0,0,0,0,0,{"$f":"SUM(D47:L47*(D47:L47>=LARGE(D47:L47,Qui!$A$402)))","v":0},{"$f":"IFERROR((VLOOKUP(CONCATENATE(B47,C47),Qui!$D$301:$F$356,3,)),0)","v":0},43,null,null,0,{"$f":"IFERROR((VLOOKUP(CONCATENATE(P47,Q47),Qui!$D$301:$F$356,3,0)),0)","v":0}]
[44,null,null,0,0,0,0,0,0,0,0,0,{"$f":"SUM(D48:L48*(D48:L48>=LARGE(D48:L48,Qui!$A$402)))","v":0},{"$f":"IFERROR((VLOOKUP(CONCATENATE(B48,C48),Qui!$D$301:$F$356,3,)),0)","v":0},44,null,null,0,{"$f":"IFERROR((VLOOKUP(CONCATENATE(P48,Q48),Qui!$D$301:$F$356,3,0)),0)","v":0}]
[45,null,null,0,0,0,0,0,0,0,0,0,{"$f":"SUM(D49:L49*(D49:L49>=LARGE(D49:L49,Qui!$A$402)))","v":0},{"$f":"IFERROR((VLOOKUP(CONCATENATE(B49,C49),Qui!$D$301:$F$356,3,)),0)","v":0},45,null,null,0,{"$f":"IFERROR((VLOOKUP(CONCATENATE(P49,Q49),Qui!$D$301:$F$356,3,0)),0)","v":0}]
[46,null,null,0,0,0,0,0,0,0,0,0,{"$f":"SUM(D50:L50*(D50:L50>=LARGE(D50:L50,Qui!$A$402)))","v":0},{"$f":"IFERROR((VLOOKUP(CONCATENATE(B50,C50),Qui!$D$301:$F$356,3,)),0)","v":0},46,null,null,0,{"$f":"IFERROR((VLOOKUP(CONCATENATE(P50,Q50),Qui!$D$301:$F$356,3,0)),0)","v":0}]
[47,null,null,0,0,0,0,0,0,0,0,0,{"$f":"SUM(D51:L51*(D51:L51>=LARGE(D51:L51,Qui!$A$402)))","v":0},{"$f":"IFERROR((VLOOKUP(CONCATENATE(B51,C51),Qui!$D$301:$F$356,3,)),0)","v":0},47,null,null,0,{"$f":"IFERROR((VLOOKUP(CONCATENATE(P51,Q51),Qui!$D$301:$F$356,3,0)),0)","v":0}]
[48,null,null,0,0,0,0,0,0,0,0,0,{"$f":"SUM(D52:L52*(D52:L52>=LARGE(D52:L52,Qui!$A$402)))","v":0},{"$f":"IFERROR((VLOOKUP(CONCATENATE(B52,C52),Qui!$D$301:$F$356,3,)),0)","v":0},48,null,null,0,{"$f":"IFERROR((VLOOKUP(CONCATENATE(P52,Q52),Qui!$D$301:$F$356,3,0)),0)","v":0}]
[49,null,null,0,0,0,0,0,0,0,0,0,{"$f":"SUM(D53:L53*(D53:L53>=LARGE(D53:L53,Qui!$A$402)))","v":0},{"$f":"IFERROR((VLOOKUP(CONCATENATE(B53,C53),Qui!$D$301:$F$356,3,)),0)","v":0},49,null,null,0,{"$f":"IFERROR((VLOOKUP(CONCATENATE(P53,Q53),Qui!$D$301:$F$356,3,0)),0)","v":0}]
[50,null,null,0,0,0,0,0,0,0,0,0,{"$f":"SUM(D54:L54*(D54:L54>=LARGE(D54:L54,Qui!$A$402)))","v":0},{"$f":"IFERROR((VLOOKUP(CONCATENATE(B54,C54),Qui!$D$301:$F$356,3,)),0)","v":0},50,null,null,0,{"$f":"IFERROR((VLOOKUP(CONCATENATE(P54,Q54),Qui!$D$301:$F$356,3,0)),0)","v":0}]
[51,null,null,0,0,0,0,0,0,0,0,0,{"$f":"SUM(D55:L55*(D55:L55>=LARGE(D55:L55,Qui!$A$402)))","v":0},{"$f":"IFERROR((VLOOKUP(CONCATENATE(B55,C55),Qui!$D$301:$F$356,3,)),0)","v":0},51,null,null,0,{"$f":"IFERROR((VLOOKUP(CONCATENATE(P55,Q55),Qui!$D$301:$F$356,3,0)),0)","v":0}]
[52,null,null,0,0,0,0,0,0,0,0,0,{"$f":"SUM(D56:L56*(D56:L56>=LARGE(D56:L56,Qui!$A$402)))","v":0},{"$f":"IFERROR((VLOOKUP(CONCATENATE(B56,C56),Qui!$D$301:$F$356,3,)),0)","v":0},52,null,null,0,{"$f":"IFERROR((VLOOKUP(CONCATENATE(P56,Q56),Qui!$D$301:$F$356,3,0)),0)","v":0}]
[53,null,null,null,0,0,0,0,0,0,0,0,{"$f":"SUM(D57:L57*(D57:L57>=LARGE(D57:L57,Qui!$A$402)))","v":0},{"$f":"IFERROR((VLOOKUP(CONCATENATE(B57,C57),Qui!$D$301:$F$356,3,)),0)","v":0},53,null,null,0,{"$f":"IFERROR((VLOOKUP(CONCATENATE(P57,Q57),Qui!$D$301:$F$356,3,0)),0)","v":0}]
[54,null,null,null,0,0,0,0,0,0,0,0,{"$f":"SUM(D58:L58*(D58:L58>=LARGE(D58:L58,Qui!$A$402)))","v":0},{"$f":"IFERROR((VLOOKUP(CONCATENATE(B58,C58),Qui!$D$301:$F$356,3,)),0)","v":0},54,null,null,0,{"$f":"IFERROR((VLOOKUP(CONCATENATE(P58,Q58),Qui!$D$301:$F$356,3,0)),0)","v":0}]
[null,null,null,{"$f":"MAX(D5:D58)","v":0},null,{"$f":"MAX(F5:F58)","v":0},{"$f":"MAX(G5:G58)","v":0},null,{"$f":"MAX(I5:I58)","v":0},{"$f":"MAX(J5:J58)","v":0},{"$f":"MAX(K5:K58)","v":0},{"$f":"MAX(L5:L58)","v":0}]
["Classement général par équipe",null,null,null,null,null,null,null,null,null,null,null,null,null,"Classement par équipe"]
[]
[1,null,null,null,null,null,null,null,null,null,null,null,{"$f":"SUM(D62:L62)","v":0},{"$f":"VLOOKUP(B62,Qui!$A$201:$D$204,4)","v":{"$error":"#N/A"}},1,null,null,0,{"$f":"VLOOKUP(P62,Qui!$A$201:$D$204,4)","v":{"$error":"#N/A"}}]
[2,null,null,null,null,null,null,null,null,null,null,null,0,{"$f":"VLOOKUP(B63,Qui!$A$201:$D$204,4)","v":{"$error":"#N/A"}},2,null,null,0,{"$f":"VLOOKUP(P63,Qui!$A$201:$D$204,4)","v":{"$error":"#N/A"}}]
[3,null,null,null,null,null,null,null,null,null,null,null,0,{"$f":"VLOOKUP(B64,Qui!$A$201:$D$204,4)","v":{"$error":"#N/A"}},3,null,null,0,{"$f":"VLOOKUP(P64,Qui!$A$201:$D$204,4)","v":{"$error":"#N/A"}}]
[4,null,null,null,null,null,null,null,null,null,null,null,0,{"$f":"VLOOKUP(B65,Qui!$A$201:$D$204,4)","v":{"$error":"#N/A"}},4,null,null,0,{"$f":"VLOOKUP(P65,Qui!$A$201:$D$204,4)","v":{"$error":"#N/A"}}]
[5,null,null,null,435,{"$error":"#N/A"},null,null,null,null,null,null,{"$error":"#N/A"},{"$f":"VLOOKUP(B66,Qui!$A$201:$D$204,4)","v":{"$error":"#N/A"}},5,null,null,{"$f":"SUMPRODUCT(((($S$5:$S$58=S66)*$R$5:$R$58*1))*((($S$5:$S$58=S66)*$R$5:$R$58*1)>=LARGE((($S$5:$S$58=S66)*$R$5:$R$58*1),Qui!$B$402)))","v":{"$error":"#N/A"}},{"$f":"VLOOKUP(P66,Qui!$A$201:$D$204,4)","v":{"$error":"#N/A"}}]
[6,null,null,null,435,{"$error":"#N/A"},null,null,null,null,null,null,{"$error":"#N/A"},{"$f":"VLOOKUP(B67,Qui!$A$201:$D$204,4)","v":{"$error":"#N/A"}},6,null,null,{"$f":"SUMPRODUCT(((($S$5:$S$58=S67)*$R$5:$R$58*1))*((($S$5:$S$58=S67)*$R$5:$R$58*1)>=LARGE((($S$5:$S$58=S67)*$R$5:$R$58*1),Qui!$B$402)))","v":{"$error":"#N/A"}},{"$f":"VLOOKUP(P67,Qui!$A$201:$D$204,4)","v":{"$error":"#N/A"}}]
[null,null,null,{"$f":"MAX(D62:D67)","v":0},null,{"$f":"MAX(F62:F67)","v":{"$error":"#N/A"}},{"$f":"MAX(G62:G67)","v":0},null,{"$f":"MAX(I62:I67)","v":0},{"$f":"MAX(J62:J67)","v":0},{"$f":"MAX(K62:K67)","v":0},{"$f":"MAX(L62:L67)","v":0},null,null,null,null,null,0]
[null,null,null,null,null,null,null,null,null,null,null,null,"La Chaux-de-Fonds, le 08 octobre 2019, CM / DP"]
[]
[null,{"$f":"CONCATENATE(\"Rappels :\")","v":"Rappels :"}]
[]
[null,{"$f":"CONCATENATE(\"a) le classement général par équipe  est fait sur le cumul des \",Qui!$B$402,\" meilleurs résultats individuels de chaque manche\")","v":"a) le classement général par équipe  est fait sur le cumul des 5 meilleurs résultats individuels de chaque manche"}]
[null,{"$f":"CONCATENATE(\"b) le classement général individuel est fait sur le cumul des \",Qui!$A$402,\" meilleurs résultats individuels\")","v":"b) le classement général individuel est fait sur le cumul des 5 meilleurs résultats individuels"}]
[]
[]
[]
[]
[]
[]
[]
[]
[]
[]
[]
[]
[]
[]
[]
[]
[]
[]
[]
[]
[]
[]
[]
[]
[]
[]
[]
[]
[]
[]
[]
[]
[]
[]
[]
[]
[]
[]
[]
[]
[]
[]
[]
[]
[]
[]
[]
[]
[]
[]
[]
[]
[]
[]
[]
[]
[]
[]
[]
[]
[]
[]
[]
[]
[]
[]
[]
[]
[]
[]
[]
[]
[]
[]
[]
[]
[]
[]
[]
[]
[]
[]
[]
[]
[]
[]
[]
[]
[]
[]
[]
[]
[]
[]
[]
[]
[]
[]
[]
[]
[]
[]
[]
[]
[]
[]
[]
[]
[]
[]
[]
[]
[]
[]
[]
[]
[]
[]
[]
[]
[]
[]
[]
[]
[null,null,null,null,null,"Duplicata Colonne A\ntechnique"]

{"sheet":"Manche_4","index":6,"n_rows":199,"n_cols":21,"rows_kept":199,"cut":false,"hidden":true,"merged":[[73,1,73,17],[0,0,0,17],[1,0,1,17],[2,0,2,1],[2,15,2,17],[3,15,3,17],[60,1,60,2],[60,15,60,16],[67,1,67,2],[68,12,68,17],[70,1,70,17],[71,1,71,17],[72,1,72,17]]}
["Association intercantonale \ndes joueurs de boules\nGrand Jeu Neuchâtelois"]
[{"$f":"CONCATENATE(\"Championnat grand jeu neuchâtelois \",YEAR(Calendrier!B6))","v":"Championnat grand jeu neuchâtelois 2020"}]
["Classement général individuel",null,"Manches",{"$f":"Calendrier!F40","v":"Le Locle"},{"$f":"Calendrier!F47","v":"Grand-Sommartel"},{"$f":"Calendrier!F54","v":"L'Epi"},{"$f":"Calendrier!F61","v":"La  Chaux-de-Fonds"},{"$f":"Calendrier!F68","v":"Evologia"},{"$f":"Calendrier!F75","v":"La  Vue-des-Alpes"},{"$f":"Calendrier!F82","v":"00:00:00"},null,null,{"$f":"CONCATENATE(\"Général\",CHAR(10),\"les \",Qui!$A$402,\" meilleurs\")","v":"Général\nles 5 meilleurs"},null,null,{"$f":"CONCATENATE(\"Classement de la manche\",CHAR(10),Calendrier!F61,CHAR(10),\"du\",TEXT(Calendrier!F63,\" jj.mm\"),\" au\",TEXT(Calendrier!F66,\" jj.mm.aaaa\"))","v":"Classement de la manche\nLa  Chaux-de-Fonds\ndu 05.10 au 08.10.2020"},null,null,null,null,{"$f":"CONCATENATE(TEXT(Calendrier!F63,\" jj.mm\"),\" au\",TEXT(Calendrier!F66,\" jj.mm.aaaa\"))","v":" 05.10 au 08.10.2020"}]
[null,null,null,1,2,3,4,5,6,7,8,9,null,null,null,{"$f":"CONCATENATE(\"Champion de jeu : \",CHAR(10),P5,\" \",Q5)","v":"Champion de jeu : \n "}]
[1,null,null,null,null,null,null,null,null,null,null,null,{"$f":"SUM(D5:L5*(D5:L5>=LARGE(D5:L5,Qui!$A$402)))","v":{"$error":"#NUM!"}},{"$f":"IFERROR((VLOOKUP(CONCATENATE(B5,C5),Qui!$D$301:$F$356,3,)),0)","v":0},1,null,null,0,{"$f":"IFERROR((VLOOKUP(CONCATENATE(P5,Q5),Qui!$D$301:$F$356,3,0)),0)","v":0}]
[2,null,null,null,null,null,null,null,null,null,null,null,{"$f":"SUM(D6:L6*(D6:L6>=LARGE(D6:L6,Qui!$A$402)))","v":{"$error":"#NUM!"}},{"$f":"IFERROR((VLOOKUP(CONCATENATE(B6,C6),Qui!$D$301:$F$356,3,)),0)","v":0},2,null,null,0,{"$f":"IFERROR((VLOOKUP(CONCATENATE(P6,Q6),Qui!$D$301:$F$356,3,0)),0)","v":0}]
[3,null,null,null,null,null,null,null,null,null,null,null,{"$f":"SUM(D7:L7*(D7:L7>=LARGE(D7:L7,Qui!$A$402)))","v":{"$error":"#NUM!"}},{"$f":"IFERROR((VLOOKUP(CONCATENATE(B7,C7),Qui!$D$301:$F$356,3,)),0)","v":0},3,null,null,0,{"$f":"IFERROR((VLOOKUP(CONCATENATE(P7,Q7),Qui!$D$301:$F$356,3,0)),0)","v":0}]
[4,null,null,null,null,null,null,null,null,null,null,null,{"$f":"SUM(D8:L8*(D8:L8>=LARGE(D8:L8,Qui!$A$402)))","v":{"$error":"#NUM!"}},{"$f":"IFERROR((VLOOKUP(CONCATENATE(B8,C8),Qui!$D$301:$F$356,3,)),0)","v":0},4,null,null,0,{"$f":"IFERROR((VLOOKUP(CONCATENATE(P8,Q8),Qui!$D$301:$F$356,3,0)),0)","v":0}]
[5,null,null,null,null,null,null,null,null,null,null,null,{"$f":"SUM(D9:L9*(D9:L9>=LARGE(D9:L9,Qui!$A$402)))","v":{"$error":"#NUM!"}},{"$f":"IFERROR((VLOOKUP(CONCATENATE(B9,C9),Qui!$D$301:$F$356,3,)),0)","v":0},5,null,null,0,{"$f":"IFERROR((VLOOKUP(CONCATENATE(P9,Q9),Qui!$D$301:$F$356,3,0)),0)","v":0}]
[6,null,null,null,null,null,null,null,null,null,null,null,{"$f":"SUM(D10:L10*(D10:L10>=LARGE(D10:L10,Qui!$A$402)))","v":{"$error":"#NUM!"}},{"$f":"IFERROR((VLOOKUP(CONCATENATE(B10,C10),Qui!$D$301:$F$356,3,)),0)","v":0},6,null,null,0,{"$f":"IFERROR((VLOOKUP(CONCATENATE(P10,Q10),Qui!$D$301:$F$356,3,0)),0)","v":0}]
[7,null,null,null,null,null,null,null,null,null,null,null,{"$f":"SUM(D11:L11*(D11:L11>=LARGE(D11:L11,Qui!$A$402)))","v":{"$error":"#NUM!"}},{"$f":"IFERROR((VLOOKUP(CONCATENATE(B11,C11),Qui!$D$301:$F$356,3,)),0)","v":0},7,null,null,0,{"$f":"IFERROR((VLOOKUP(CONCATENATE(P11,Q11),Qui!$D$301:$F$356,3,0)),0)","v":0}]
[8,null,null,null,null,null,null,null,null,null,null,null,{"$f":"SUM(D12:L12*(D12:L12>=LARGE(D12:L12,Qui!$A$402)))","v":{"$error":"#NUM!"}},{"$f":"IFERROR((VLOOKUP(CONCATENATE(B12,C12),Qui!$D$301:$F$356,3,)),0)","v":0},8,null,null,0,{"$f":"IFERROR((VLOOKUP(CONCATENATE(P12,Q12),Qui!$D$301:$F$356,3,0)),0)","v":0}]
[9,null,null,null,null,null,null,null,null,null,null,null,{"$f":"SUM(D13:L13*(D13:L13>=LARGE(D13:L13,Qui!$A$402)))","v":{"$error":"#NUM!"}},{"$f":"IFERROR((VLOOKUP(CONCATENATE(B13,C13),Qui!$D$301:$F$356,3,)),0)","v":0},9,null,null,0,{"$f":"IFERROR((VLOOKUP(CONCATENATE(P13,Q13),Qui!$D$301:$F$356,3,0)),0)","v":0}]
[10,null,null,null,null,null,null,null,null,null,null,null,{"$f":"SUM(D14:L14*(D14:L14>=LARGE(D14:L14,Qui!$A$402)))","v":{"$error":"#NUM!"}},{"$f":"IFERROR((VLOOKUP(CONCATENATE(B14,C14),Qui!$D$301:$F$356,3,)),0)","v":0},10,null,null,0,{"$f":"IFERROR((VLOOKUP(CONCATENATE(P14,Q14),Qui!$D$301:$F$356,3,0)),0)","v":0}]
[11,null,null,null,null,null,null,null,null,null,null,null,{"$f":"SUM(D15:L15*(D15:L15>=LARGE(D15:L15,Qui!$A$402)))","v":{"$error":"#NUM!"}},{"$f":"IFERROR((VLOOKUP(CONCATENATE(B15,C15),Qui!$D$301:$F$356,3,)),0)","v":0},11,null,null,0,{"$f":"IFERROR((VLOOKUP(CONCATENATE(P15,Q15),Qui!$D$301:$F$356,3,0)),0)","v":0}]
[12,null,null,null,null,null,null,null,null,null,null,null,{"$f":"SUM(D16:L16*(D16:L16>=LARGE(D16:L16,Qui!$A$402)))","v":{"$error":"#NUM!"}},{"$f":"IFERROR((VLOOKUP(CONCATENATE(B16,C16),Qui!$D$301:$F$356,3,)),0)","v":0},12,null,null,0,{"$f":"IFERROR((VLOOKUP(CONCATENATE(P16,Q16),Qui!$D$301:$F$356,3,0)),0)","v":0}]
[13,null,null,null,null,null,null,null,null,null,null,null,{"$f":"SUM(D17:L17*(D17:L17>=LARGE(D17:L17,Qui!$A$402)))","v":{"$error":"#NUM!"}},{"$f":"IFERROR((VLOOKUP(CONCATENATE(B17,C17),Qui!$D$301:$F$356,3,)),0)","v":0},13,null,null,0,{"$f":"IFERROR((VLOOKUP(CONCATENATE(P17,Q17),Qui!$D$301:$F$356,3,0)),0)","v":0}]
[14,null,null,null,null,null,null,null,null,null,null,null,{"$f":"SUM(D18:L18*(D18:L18>=LARGE(D18:L18,Qui!$A$402)))","v":{"$error":"#NUM!"}},{"$f":"IFERROR((VLOOKUP(CONCATENATE(B18,C18),Qui!$D$301:$F$356,3,)),0)","v":0},14,null,null,0,{"$f":"IFERROR((VLOOKUP(CONCATENATE(P18,Q18),Qui!$D$301:$F$356,3,0)),0)","v":0}]
[15,null,null,null,null,null,null,null,null,null,null,null,{"$f":"SUM(D19:L19*(D19:L19>=LARGE(D19:L19,Qui!$A$402)))","v":{"$error":"#NUM!"}},{"$f":"IFERROR((VLOOKUP(CONCATENATE(B19,C19),Qui!$D$301:$F$356,3,)),0)","v":0},15,null,null,0,{"$f":"IFERROR((VLOOKUP(CONCATENATE(P19,Q19),Qui!$D$301:$F$356,3,0)),0)","v":0}]
[16,null,null,null,null,null,null,null,null,null,null,null,{"$f":"SUM(D20:L20*(D20:L20>=LARGE(D20:L20,Qui!$A$402)))","v":{"$error":"#NUM!"}},{"$f":"IFERROR((VLOOKUP(CONCATENATE(B20,C20),Qui!$D$301:$F$356,3,)),0)","v":0},16,null,null,0,{"$f":"IFERROR((VLOOKUP(CONCATENATE(P20,Q20),Qui!$D$301:$F$356,3,0)),0)","v":0}]
[17,null,null,null,null,null,null,null,null,null,null,null,{"$f":"SUM(D21:L21*(D21:L21>=LARGE(D21:L21,Qui!$A$402)))","v":{"$error":"#NUM!"}},{"$f":"IFERROR((VLOOKUP(CONCATENATE(B21,C21),Qui!$D$301:$F$356,3,)),0)","v":0},17,null,null,0,{"$f":"IFERROR((VLOOKUP(CONCATENATE(P21,Q21),Qui!$D$301:$F$356,3,0)),0)","v":0}]
[18,null,null,null,null,null,null,null,null,null,null,null,{"$f":"SUM(D22:L22*(D22:L22>=LARGE(D22:L22,Qui!$A$402)))","v":{"$error":"#NUM!"}},{"$f":"IFERROR((VLOOKUP(CONCATENATE(B22,C22),Qui!$D$301:$F$356,3,)),0)","v":0},18,null,null,0,{"$f":"IFERROR((VLOOKUP(CONCATENATE(P22,Q22),Qui!$D$301:$F$356,3,0)),0)","v":0}]
[19,null,null,null,null,null,null,null,null,null,null,null,{"$f":"SUM(D23:L23*(D23:L23>=LARGE(D23:L23,Qui!$A$402)))","v":{"$error":"#NUM!"}},{"$f":"IFERROR((VLOOKUP(CONCATENATE(B23,C23),Qui!$D$301:$F$356,3,)),0)","v":0},19,null,null,0,{"$f":"IFERROR((VLOOKUP(CONCATENATE(P23,Q23),Qui!$D$301:$F$356,3,0)),0)","v":0}]
[20,null,null,null,null,null,null,null,null,null,null,null,{"$f":"SUM(D24:L24*(D24:L24>=LARGE(D24:L24,Qui!$A$402)))","v":{"$error":"#NUM!"}},{"$f":"IFERROR((VLOOKUP(CONCATENATE(B24,C24),Qui!$D$301:$F$356,3,)),0)","v":0},20,null,null,0,{"$f":"IFERROR((VLOOKUP(CONCATENATE(P24,Q24),Qui!$D$301:$F$356,3,0)),0)","v":0}]
[21,null,null,null,null,null,null,null,null,null,null,null,{"$f":"SUM(D25:L25*(D25:L25>=LARGE(D25:L25,Qui!$A$402)))","v":{"$error":"#NUM!"}},{"$f":"IFERROR((VLOOKUP(CONCATENATE(B25,C25),Qui!$D$301:$F$356,3,)),0)","v":0},21,null,null,0,{"$f":"IFERROR((VLOOKUP(CONCATENATE(P25,Q25),Qui!$D$301:$F$356,3,0)),0)","v":0}]
[22,null,null,null,null,null,null,null,null,null,null,null,{"$f":"SUM(D26:L26*(D26:L26>=LARGE(D26:L26,Qui!$A$402)))","v":{"$error":"#NUM!"}},{"$f":"IFERROR((VLOOKUP(CONCATENATE(B26,C26),Qui!$D$301:$F$356,3,)),0)","v":0},22,null,null,0,{"$f":"IFERROR((VLOOKUP(CONCATENATE(P26,Q26),Qui!$D$301:$F$356,3,0)),0)","v":0}]
[23,null,null,null,null,null,null,null,null,null,null,null,{"$f":"SUM(D27:L27*(D27:L27>=LARGE(D27:L27,Qui!$A$402)))","v":{"$error":"#NUM!"}},{"$f":"IFERROR((VLOOKUP(CONCATENATE(B27,C27),Qui!$D$301:$F$356,3,)),0)","v":0},23,null,null,0,{"$f":"IFERROR((VLOOKUP(CONCATENATE(P27,Q27),Qui!$D$301:$F$356,3,0)),0)","v":0}]
[24,null,null,null,null,null,null,null,null,null,null,null,{"$f":"SUM(D28:L28*(D28:L28>=LARGE(D28:L28,Qui!$A$402)))","v":{"$error":"#NUM!"}},{"$f":"IFERROR((VLOOKUP(CONCATENATE(B28,C28),Qui!$D$301:$F$356,3,)),0)","v":0},24,null,null,0,{"$f":"IFERROR((VLOOKUP(CONCATENATE(P28,Q28),Qui!$D$301:$F$356,3,0)),0)","v":0}]
[25,null,null,null,null,null,null,null,null,null,null,null,{"$f":"SUM(D29:L29*(D29:L29>=LARGE(D29:L29,Qui!$A$402)))","v":{"$error":"#NUM!"}},{"$f":"IFERROR((VLOOKUP(CONCATENATE(B29,C29),Qui!$D$301:$F$356,3,)),0)","v":0},25,null,null,0,{"$f":"IFERROR((VLOOKUP(CONCATENATE(P29,Q29),Qui!$D$301:$F$356,3,0)),0)","v":0}]
[26,null,null,null,null,null,null,null,null,null,null,null,{"$f":"SUM(D30:L30*(D30:L30>=LARGE(D30:L30,Qui!$A$402)))","v":{"$error":"#NUM!"}},{"$f":"IFERROR((VLOOKUP(CONCATENATE(B30,C30),Qui!$D$301:$F$356,3,)),0)","v":0},26,null,null,0,{"$f":"IFERROR((VLOOKUP(CONCATENATE(P30,Q30),Qui!$D$301:$F$356,3,0)),0)","v":0}]
[27,null,null,null,null,null,null,null,null,null,null,null,{"$f":"SUM(D31:L31*(D31:L31>=LARGE(D31:L31,Qui!$A$402)))","v":{"$error":"#NUM!"}},{"$f":"IFERROR((VLOOKUP(CONCATENATE(B31,C31),Qui!$D$301:$F$356,3,)),0)","v":0},27,null,null,0,{"$f":"IFERROR((VLOOKUP(CONCATENATE(P31,Q31),Qui!$D$301:$F$356,3,0)),0)","v":0}]
[28,null,null,null,null,null,null,null,null,null,null,null,{"$f":"SUM(D32:L32*(D32:L32>=LARGE(D32:L32,Qui!$A$402)))","v":{"$error":"#NUM!"}},{"$f":"IFERROR((VLOOKUP(CONCATENATE(B32,C32),Qui!$D$301:$F$356,3,)),0)","v":0},28,null,null,0,{"$f":"IFERROR((VLOOKUP(CONCATENATE(P32,Q32),Qui!$D$301:$F$356,3,0)),0)","v":0}]
[29,null,null,null,null,null,null,null,null,null,null,null,{"$f":"SUM(D33:L33*(D33:L33>=LARGE(D33:L33,Qui!$A$402)))","v":{"$error":"#NUM!"}},{"$f":"IFERROR((VLOOKUP(CONCATENATE(B33,C33),Qui!$D$301:$F$356,3,)),0)","v":0},29,null,null,0,{"$f":"IFERROR((VLOOKUP(CONCATENATE(P33,Q33),Qui!$D$301:$F$356,3,0)),0)","v":0}]
[30,null,null,null,null,null,null,null,null,null,null,null,{"$f":"SUM(D34:L34*(D34:L34>=LARGE(D34:L34,Qui!$A$402)))","v":{"$error":"#NUM!"}},{"$f":"IFERROR((VLOOKUP(CONCATENATE(B34,C34),Qui!$D$301:$F$356,3,)),0)","v":0},30,null,null,0,{"$f":"IFERROR((VLOOKUP(CONCATENATE(P34,Q34),Qui!$D$301:$F$356,3,0)),0)","v":0}]
[31,null,null,null,null,null,null,null,null,null,null,null,{"$f":"SUM(D35:L35*(D35:L35>=LARGE(D35:L35,Qui!$A$402)))","v":{"$error":"#NUM!"}},{"$f":"IFERROR((VLOOKUP(CONCATENATE(B35,C35),Qui!$D$301:$F$356,3,)),0)","v":0},31,null,null,0,{"$f":"IFERROR((VLOOKUP(CONCATENATE(P35,Q35),Qui!$D$301:$F$356,3,0)),0)","v":0}]
[32,null,null,null,null,null,null,null,null,null,null,null,{"$f":"SUM(D36:L36*(D36:L36>=LARGE(D36:L36,Qui!$A$402)))","v":{"$error":"#NUM!"}},{"$f":"IFERROR((VLOOKUP(CONCATENATE(B36,C36),Qui!$D$301:$F$356,3,)),0)","v":0},32,null,null,0,{"$f":"IFERROR((VLOOKUP(CONCATENATE(P36,Q36),Qui!$D$301:$F$356,3,0)),0)","v":0}]
[33,null,null,null,null,null,null,null,null,null,null,null,{"$f":"SUM(D37:L37*(D37:L37>=LARGE(D37:L37,Qui!$A$402)))","v":{"$error":"#NUM!"}},{"$f":"IFERROR((VLOOKUP(CONCATENATE(B37,C37),Qui!$D$301:$F$356,3,)),0)","v":0},33,null,null,0,{"$f":"IFERROR((VLOOKUP(CONCATENATE(P37,Q37),Qui!$D$301:$F$356,3,0)),0)","v":0}]
[34,null,null,null,null,null,null,null,null,null,null,null,{"$f":"SUM(D38:L38*(D38:L38>=LARGE(D38:L38,Qui!$A$402)))","v":{"$error":"#NUM!"}},{"$f":"IFERROR((VLOOKUP(CONCATENATE(B38,C38),Qui!$D$301:$F$356,3,)),0)","v":0},34,null,null,0,{"$f":"IFERROR((VLOOKUP(CONCATENATE(P38,Q38),Qui!$D$301:$F$356,3,0)),0)","v":0}]
[35,null,null,null,null,null,null,null,null,null,null,null,{"$f":"SUM(D39:L39*(D39:L39>=LARGE(D39:L39,Qui!$A$402)))","v":{"$error":"#NUM!"}},{"$f":"IFERROR((VLOOKUP(CONCATENATE(B39,C39),Qui!$D$301:$F$356,3,)),0)","v":0},35,null,null,0,{"$f":"IFERROR((VLOOKUP(CONCATENATE(P39,Q39),Qui!$D$301:$F$356,3,0)),0)","v":0}]
[36,null,null,0,0,0,0,0,0,0,0,0,{"$f":"SUM(D40:L40*(D40:L40>=LARGE(D40:L40,Qui!$A$402)))","v":0},{"$f":"IFERROR((VLOOKUP(CONCATENATE(B40,C40),Qui!$D$301:$F$356,3,)),0)","v":0},36,null,null,0,{"$f":"IFERROR((VLOOKUP(CONCATENATE(P40,Q40),Qui!$D$301:$F$356,3,0)),0)","v":0}]
[37,null,null,0,0,0,0,0,0,0,0,0,{"$f":"SUM(D41:L41*(D41:L41>=LARGE(D41:L41,Qui!$A$402)))","v":0},{"$f":"IFERROR((VLOOKUP(CONCATENATE(B41,C41),Qui!$D$301:$F$356,3,)),0)","v":0},37,null,null,0,{"$f":"IFERROR((VLOOKUP(CONCATENATE(P41,Q41),Qui!$D$301:$F$356,3,0)),0)","v":0}]
[38,null,null,0,0,0,0,0,0,0,0,0,{"$f":"SUM(D42:L42*(D42:L42>=LARGE(D42:L42,Qui!$A$402)))","v":0},{"$f":"IFERROR((VLOOKUP(CONCATENATE(B42,C42),Qui!$D$301:$F$356,3,)),0)","v":0},38,null,null,0,{"$f":"IFERROR((VLOOKUP(CONCATENATE(P42,Q42),Qui!$D$301:$F$356,3,0)),0)","v":0}]
[39,null,null,0,0,0,0,0,0,0,0,0,{"$f":"SUM(D43:L43*(D43:L43>=LARGE(D43:L43,Qui!$A$402)))","v":0},{"$f":"IFERROR((VLOOKUP(CONCATENATE(B43,C43),Qui!$D$301:$F$356,3,)),0)","v":0},39,null,null,0,{"$f":"IFERROR((VLOOKUP(CONCATENATE(P43,Q43),Qui!$D$301:$F$356,3,0)),0)","v":0}]
[40,null,null,0,0,0,0,0,0,0,0,0,{"$f":"SUM(D44:L44*(D44:L44>=LARGE(D44:L44,Qui!$A$402)))","v":0},{"$f":"IFERROR((VLOOKUP(CONCATENATE(B44,C44),Qui!$D$301:$F$356,3,)),0)","v":0},40,null,null,0,{"$f":"IFERROR((VLOOKUP(CONCATENATE(P44,Q44),Qui!$D$301:$F$356,3,0)),0)","v":0}]
[41,null,null,0,0,0,0,0,0,0,0,0,{"$f":"SUM(D45:L45*(D45:L45>=LARGE(D45:L45,Qui!$A$402)))","v":0},{"$f":"IFERROR((VLOOKUP(CONCATENATE(B45,C45),Qui!$D$301:$F$356,3,)),0)","v":0},41,null,null,0,{"$f":"IFERROR((VLOOKUP(CONCATENATE(P45,Q45),Qui!$D$301:$F$356,3,0)),0)","v":0}]
[42,null,null,0,0,0,0,0,0,0,0,0,{"$f":"SUM(D46:L46*(D46:L46>=LARGE(D46:L46,Qui!$A$402)))","v":0},{"$f":"IFERROR((VLOOKUP(CONCATENATE(B46,C46),Qui!$D$301:$F$356,3,)),0)","v":0},42,null,null,0,{"$f":"IFERROR((VLOOKUP(CONCATENATE(P46,Q46),Qui!$D$301:$F$356,3,0)),0)","v":0}]
[43,null,null,0,0,0,0,0,0,0,0,0,{"$f":"SUM(D47:L47*(D47:L47>=LARGE(D47:L47,Qui!$A$402)))","v":0},{"$f":"IFERROR((VLOOKUP(CONCATENATE(B47,C47),Qui!$D$301:$F$356,3,)),0)","v":0},43,null,null,0,{"$f":"IFERROR((VLOOKUP(CONCATENATE(P47,Q47),Qui!$D$301:$F$356,3,0)),0)","v":0}]
[44,null,null,0,0,0,0,0,0,0,0,0,{"$f":"SUM(D48:L48*(D48:L48>=LARGE(D48:L48,Qui!$A$402)))","v":0},{"$f":"IFERROR((VLOOKUP(CONCATENATE(B48,C48),Qui!$D$301:$F$356,3,)),0)","v":0},44,null,null,0,{"$f":"IFERROR((VLOOKUP(CONCATENATE(P48,Q48),Qui!$D$301:$F$356,3,0)),0)","v":0}]
[45,null,null,0,0,0,0,0,0,0,0,0,{"$f":"SUM(D49:L49*(D49:L49>=LARGE(D49:L49,Qui!$A$402)))","v":0},{"$f":"IFERROR((VLOOKUP(CONCATENATE(B49,C49),Qui!$D$301:$F$356,3,)),0)","v":0},45,null,null,0,{"$f":"IFERROR((VLOOKUP(CONCATENATE(P49,Q49),Qui!$D$301:$F$356,3,0)),0)","v":0}]
[46,null,null,0,0,0,0,0,0,0,0,0,{"$f":"SUM(D50:L50*(D50:L50>=LARGE(D50:L50,Qui!$A$402)))","v":0},{"$f":"IFERROR((VLOOKUP(CONCATENATE(B50,C50),Qui!$D$301:$F$356,3,)),0)","v":0},46,null,null,0,{"$f":"IFERROR((VLOOKUP(CONCATENATE(P50,Q50),Qui!$D$301:$F$356,3,0)),0)","v":0}]
[47,null,null,0,0,0,0,0,0,0,0,0,{"$f":"SUM(D51:L51*(D51:L51>=LARGE(D51:L51,Qui!$A$402)))","v":0},{"$f":"IFERROR((VLOOKUP(CONCATENATE(B51,C51),Qui!$D$301:$F$356,3,)),0)","v":0},47,null,null,0,{"$f":"IFERROR((VLOOKUP(CONCATENATE(P51,Q51),Qui!$D$301:$F$356,3,0)),0)","v":0}]
[48,null,null,0,0,0,0,0,0,0,0,0,{"$f":"SUM(D52:L52*(D52:L52>=LARGE(D52:L52,Qui!$A$402)))","v":0},{"$f":"IFERROR((VLOOKUP(CONCATENATE(B52,C52),Qui!$D$301:$F$356,3,)),0)","v":0},48,null,null,0,{"$f":"IFERROR((VLOOKUP(CONCATENATE(P52,Q52),Qui!$D$301:$F$356,3,0)),0)","v":0}]
[49,null,null,0,0,0,0,0,0,0,0,0,{"$f":"SUM(D53:L53*(D53:L53>=LARGE(D53:L53,Qui!$A$402)))","v":0},{"$f":"IFERROR((VLOOKUP(CONCATENATE(B53,C53),Qui!$D$301:$F$356,3,)),0)","v":0},49,null,null,0,{"$f":"IFERROR((VLOOKUP(CONCATENATE(P53,Q53),Qui!$D$301:$F$356,3,0)),0)","v":0}]
[50,null,null,0,0,0,0,0,0,0,0,0,{"$f":"SUM(D54:L54*(D54:L54>=LARGE(D54:L54,Qui!$A$402)))","v":0},{"$f":"IFERROR((VLOOKUP(CONCATENATE(B54,C54),Qui!$D$301:$F$356,3,)),0)","v":0},50,null,null,0,{"$f":"IFERROR((VLOOKUP(CONCATENATE(P54,Q54),Qui!$D$301:$F$356,3,0)),0)","v":0}]
[51,null,null,0,0,0,0,0,0,0,0,0,{"$f":"SUM(D55:L55*(D55:L55>=LARGE(D55:L55,Qui!$A$402)))","v":0},{"$f":"IFERROR((VLOOKUP(CONCATENATE(B55,C55),Qui!$D$301:$F$356,3,)),0)","v":0},51,null,null,0,{"$f":"IFERROR((VLOOKUP(CONCATENATE(P55,Q55),Qui!$D$301:$F$356,3,0)),0)","v":0}]
[52,null,null,0,0,0,0,0,0,0,0,0,{"$f":"SUM(D56:L56*(D56:L56>=LARGE(D56:L56,Qui!$A$402)))","v":0},{"$f":"IFERROR((VLOOKUP(CONCATENATE(B56,C56),Qui!$D$301:$F$356,3,)),0)","v":0},52,null,null,0,{"$f":"IFERROR((VLOOKUP(CONCATENATE(P56,Q56),Qui!$D$301:$F$356,3,0)),0)","v":0}]
[53,null,null,null,0,0,0,0,0,0,0,0,{"$f":"SUM(D57:L57*(D57:L57>=LARGE(D57:L57,Qui!$A$402)))","v":0},{"$f":"IFERROR((VLOOKUP(CONCATENATE(B57,C57),Qui!$D$301:$F$356,3,)),0)","v":0},53,null,null,0,{"$f":"IFERROR((VLOOKUP(CONCATENATE(P57,Q57),Qui!$D$301:$F$356,3,0)),0)","v":0}]
[54,null,null,null,0,0,0,0,0,0,0,0,{"$f":"SUM(D58:L58*(D58:L58>=LARGE(D58:L58,Qui!$A$402)))","v":0},{"$f":"IFERROR((VLOOKUP(CONCATENATE(B58,C58),Qui!$D$301:$F$356,3,)),0)","v":0},54,null,null,0,{"$f":"IFERROR((VLOOKUP(CONCATENATE(P58,Q58),Qui!$D$301:$F$356,3,0)),0)","v":0}]
[null,null,null,{"$f":"MAX(D5:D58)","v":0},null,{"$f":"MAX(F5:F58)","v":0},{"$f":"MAX(G5:G58)","v":0},null,{"$f":"MAX(I5:I58)","v":0},{"$f":"MAX(J5:J58)","v":0},{"$f":"MAX(K5:K58)","v":0},{"$f":"MAX(L5:L58)","v":0}]
["Classement général par équipe",null,null,null,null,null,null,null,null,null,null,null,null,null,"Classement par équipe"]
[]
[1,null,null,null,null,null,null,null,null,null,null,null,{"$f":"SUM(D62:L62)","v":0},{"$f":"VLOOKUP(B62,Qui!$A$201:$D$204,4)","v":{"$error":"#N/A"}},1,null,null,0,{"$f":"VLOOKUP(P62,Qui!$A$201:$D$204,4)","v":{"$error":"#N/A"}}]
[2,null,null,null,null,null,null,null,null,null,null,null,0,{"$f":"VLOOKUP(B63,Qui!$A$201:$D$204,4)","v":{"$error":"#N/A"}},2,null,null,0,{"$f":"VLOOKUP(P63,Qui!$A$201:$D$204,4)","v":{"$error":"#N/A"}}]
[3,null,null,null,null,null,null,null,null,null,null,null,0,{"$f":"VLOOKUP(B64,Qui!$A$201:$D$204,4)","v":{"$error":"#N/A"}},3,null,null,0,{"$f":"VLOOKUP(P64,Qui!$A$201:$D$204,4)","v":{"$error":"#N/A"}}]
[4,null,null,null,null,null,null,null,null,null,null,null,0,{"$f":"VLOOKUP(B65,Qui!$A$201:$D$204,4)","v":{"$error":"#N/A"}},4,null,null,0,{"$f":"VLOOKUP(P65,Qui!$A$201:$D$204,4)","v":{"$error":"#N/A"}}]
[5,null,null,null,435,{"$error":"#N/A"},{"$error":"#N/A"},null,null,null,null,null,{"$error":"#N/A"},{"$f":"VLOOKUP(B66,Qui!$A$201:$D$204,4)","v":{"$error":"#N/A"}},5,null,null,{"$f":"SUMPRODUCT(((($S$5:$S$58=S66)*$R$5:$R$58*1))*((($S$5:$S$58=S66)*$R$5:$R$58*1)>=LARGE((($S$5:$S$58=S66)*$R$5:$R$58*1),Qui!$B$402)))","v":{"$error":"#N/A"}},{"$f":"VLOOKUP(P66,Qui!$A$201:$D$204,4)","v":{"$error":"#N/A"}}]
[6,null,null,null,435,{"$error":"#N/A"},{"$error":"#N/A"},null,null,null,null,null,{"$error":"#N/A"},{"$f":"VLOOKUP(B67,Qui!$A$201:$D$204,4)","v":{"$error":"#N/A"}},6,null,null,{"$f":"SUMPRODUCT(((($S$5:$S$58=S67)*$R$5:$R$58*1))*((($S$5:$S$58=S67)*$R$5:$R$58*1)>=LARGE((($S$5:$S$58=S67)*$R$5:$R$58*1),Qui!$B$402)))","v":{"$error":"#N/A"}},{"$f":"VLOOKUP(P67,Qui!$A$201:$D$204,4)","v":{"$error":"#N/A"}}]
[null,null,null,{"$f":"MAX(D62:D67)","v":0},null,{"$f":"MAX(F62:F67)","v":{"$error":"#N/A"}},{"$f":"MAX(G62:G67)","v":{"$error":"#N/A"}},null,{"$f":"MAX(I62:I67)","v":0},{"$f":"MAX(J62:J67)","v":0},{"$f":"MAX(K62:K67)","v":0},{"$f":"MAX(L62:L67)","v":0},null,null,null,null,null,0]
[null,null,null,null,null,null,null,null,null,null,null,null,"La Chaux-de-Fonds, le 3 novembre 2019, CM / DP"]
[]
[null,{"$f":"CONCATENATE(\"Rappels :\")","v":"Rappels :"}]
[]
[null,{"$f":"CONCATENATE(\"a) le classement général par équipe  est fait sur le cumul des \",Qui!$B$402,\" meilleurs résultats individuels de chaque manche\")","v":"a) le classement général par équipe  est fait sur le cumul des 5 meilleurs résultats individuels de chaque manche"}]
[null,{"$f":"CONCATENATE(\"b) le classement général individuel est fait sur le cumul des \",Qui!$A$402,\" meilleurs résultats individuels\")","v":"b) le classement général individuel est fait sur le cumul des 5 meilleurs résultats individuels"}]
[]
[]
[]
[]
[]
[]
[]
[]
[]
[]
[]
[]
[]
[]
[]
[]
[]
[]
[]
[]
[]
[]
[]
[]
[]
[]
[]
[]
[]
[]
[]
[]
[]
[]
[]
[]
[]
[]
[]
[]
[]
[]
[]
[]
[]
[]
[]
[]
[]
[]
[]
[]
[]
[]
[]
[]
[]
[]
[]
[]
[]
[]
[]
[]
[]
[]
[]
[]
[]
[]
[]
[]
[]
[]
[]
[]
[]
[]
[]
[]
[]
[]
[]
[]
[]
[]
[]
[]
[]
[]
[]
[]
[]
[]
[]
[]
[]
[]
[]
[]
[]
[]
[]
[]
[]
[]
[]
[]
[]
[]
[]
[]
[]
[]
[]
[]
[]
[]
[]
[]
[]
[]
[]
[]
[null,null,null,null,null,"Duplicata Colonne A\ntechnique"]

{"sheet":"Manche_5","index":7,"n_rows":199,"n_cols":21,"rows_kept":199,"cut":false,"hidden":true,"merged":[[73,1,73,17],[0,0,0,17],[1,0,1,17],[2,0,2,1],[2,15,2,17],[3,15,3,17],[60,1,60,2],[60,15,60,16],[67,1,67,2],[68,12,68,17],[70,1,70,17],[71,1,71,17],[72,1,72,17]]}
["Association intercantonale \ndes joueurs de boules\nGrand Jeu Neuchâtelois"]
[{"$f":"CONCATENATE(\"Championnat grand jeu neuchâtelois \",YEAR(Calendrier!B6))","v":"Championnat grand jeu neuchâtelois 2020"}]
["Classement général individuel",null,"Manches",{"$f":"Calendrier!F40","v":"Le Locle"},{"$f":"Calendrier!F47","v":"Grand-Sommartel"},{"$f":"Calendrier!F54","v":"L'Epi"},{"$f":"Calendrier!F61","v":"La  Chaux-de-Fonds"},{"$f":"Calendrier!F68","v":"Evologia"},{"$f":"Calendrier!F75","v":"La  Vue-des-Alpes"},{"$f":"Calendrier!F82","v":"00:00:00"},null,null,{"$f":"CONCATENATE(\"Général\",CHAR(10),\"les \",Qui!$A$402,\" meilleurs\")","v":"Général\nles 5 meilleurs"},null,null,{"$f":"CONCATENATE(\"Classement de la manche\",CHAR(10),Calendrier!F68,CHAR(10),\"du\",TEXT(Calendrier!F70,\" jj.mm\"),\" au\",TEXT(Calendrier!F73,\" jj.mm.aaaa\"))","v":"Classement de la manche\nEvologia\ndu 26.10 au 29.10.2020"},null,null,null,null,{"$f":"CONCATENATE(TEXT(Calendrier!F70,\" jj.mm\"),\" au\",TEXT(Calendrier!F73,\" jj.mm.aaaa\"))","v":" 26.10 au 29.10.2020"}]
[null,null,null,1,2,3,4,5,6,7,8,9,null,null,null,{"$f":"CONCATENATE(\"Champion de jeu : \",CHAR(10),P5,\" \",Q5)","v":"Champion de jeu : \n "}]
[1,null,null,null,null,null,null,null,null,null,null,null,{"$f":"SUM(D5:L5*(D5:L5>=LARGE(D5:L5,Qui!$A$402)))","v":{"$error":"#NUM!"}},{"$f":"IFERROR((VLOOKUP(CONCATENATE(B5,C5),Qui!$D$301:$F$356,3,)),0)","v":0},1,null,null,0,{"$f":"IFERROR((VLOOKUP(CONCATENATE(P5,Q5),Qui!$D$301:$F$356,3,0)),0)","v":0}]
[2,null,null,null,null,null,null,null,null,null,null,null,{"$f":"SUM(D6:L6*(D6:L6>=LARGE(D6:L6,Qui!$A$402)))","v":{"$error":"#NUM!"}},{"$f":"IFERROR((VLOOKUP(CONCATENATE(B6,C6),Qui!$D$301:$F$356,3,)),0)","v":0},2,null,null,0,{"$f":"IFERROR((VLOOKUP(CONCATENATE(P6,Q6),Qui!$D$301:$F$356,3,0)),0)","v":0}]
[3,null,null,null,null,null,null,null,null,null,null,null,{"$f":"SUM(D7:L7*(D7:L7>=LARGE(D7:L7,Qui!$A$402)))","v":{"$error":"#NUM!"}},{"$f":"IFERROR((VLOOKUP(CONCATENATE(B7,C7),Qui!$D$301:$F$356,3,)),0)","v":0},3,null,null,0,{"$f":"IFERROR((VLOOKUP(CONCATENATE(P7,Q7),Qui!$D$301:$F$356,3,0)),0)","v":0}]
[4,null,null,null,null,null,null,null,null,null,null,null,{"$f":"SUM(D8:L8*(D8:L8>=LARGE(D8:L8,Qui!$A$402)))","v":{"$error":"#NUM!"}},{"$f":"IFERROR((VLOOKUP(CONCATENATE(B8,C8),Qui!$D$301:$F$356,3,)),0)","v":0},4,null,null,0,{"$f":"IFERROR((VLOOKUP(CONCATENATE(P8,Q8),Qui!$D$301:$F$356,3,0)),0)","v":0}]
[5,null,null,null,null,null,null,null,null,null,null,null,{"$f":"SUM(D9:L9*(D9:L9>=LARGE(D9:L9,Qui!$A$402)))","v":{"$error":"#NUM!"}},{"$f":"IFERROR((VLOOKUP(CONCATENATE(B9,C9),Qui!$D$301:$F$356,3,)),0)","v":0},5,null,null,0,{"$f":"IFERROR((VLOOKUP(CONCATENATE(P9,Q9),Qui!$D$301:$F$356,3,0)),0)","v":0}]
[6,null,null,null,null,null,null,null,null,null,null,null,{"$f":"SUM(D10:L10*(D10:L10>=LARGE(D10:L10,Qui!$A$402)))","v":{"$error":"#NUM!"}},{"$f":"IFERROR((VLOOKUP(CONCATENATE(B10,C10),Qui!$D$301:$F$356,3,)),0)","v":0},6,null,null,0,{"$f":"IFERROR((VLOOKUP(CONCATENATE(P10,Q10),Qui!$D$301:$F$356,3,0)),0)","v":0}]
[7,null,null,null,null,null,null,null,null,null,null,null,{"$f":"SUM(D11:L11*(D11:L11>=LARGE(D11:L11,Qui!$A$402)))","v":{"$error":"#NUM!"}},{"$f":"IFERROR((VLOOKUP(CONCATENATE(B11,C11),Qui!$D$301:$F$356,3,)),0)","v":0},7,null,null,0,{"$f":"IFERROR((VLOOKUP(CONCATENATE(P11,Q11),Qui!$D$301:$F$356,3,0)),0)","v":0}]
[8,null,null,null,null,null,null,null,null,null,null,null,{"$f":"SUM(D12:L12*(D12:L12>=LARGE(D12:L12,Qui!$A$402)))","v":{"$error":"#NUM!"}},{"$f":"IFERROR((VLOOKUP(CONCATENATE(B12,C12),Qui!$D$301:$F$356,3,)),0)","v":0},8,null,null,0,{"$f":"IFERROR((VLOOKUP(CONCATENATE(P12,Q12),Qui!$D$301:$F$356,3,0)),0)","v":0}]
[9,null,null,null,null,null,null,null,null,null,null,null,{"$f":"SUM(D13:L13*(D13:L13>=LARGE(D13:L13,Qui!$A$402)))","v":{"$error":"#NUM!"}},{"$f":"IFERROR((VLOOKUP(CONCATENATE(B13,C13),Qui!$D$301:$F$356,3,)),0)","v":0},9,null,null,0,{"$f":"IFERROR((VLOOKUP(CONCATENATE(P13,Q13),Qui!$D$301:$F$356,3,0)),0)","v":0}]
[10,null,null,null,null,null,null,null,null,null,null,null,{"$f":"SUM(D14:L14*(D14:L14>=LARGE(D14:L14,Qui!$A$402)))","v":{"$error":"#NUM!"}},{"$f":"IFERROR((VLOOKUP(CONCATENATE(B14,C14),Qui!$D$301:$F$356,3,)),0)","v":0},10,null,null,0,{"$f":"IFERROR((VLOOKUP(CONCATENATE(P14,Q14),Qui!$D$301:$F$356,3,0)),0)","v":0}]
[11,null,null,null,null,null,null,null,null,null,null,null,{"$f":"SUM(D15:L15*(D15:L15>=LARGE(D15:L15,Qui!$A$402)))","v":{"$error":"#NUM!"}},{"$f":"IFERROR((VLOOKUP(CONCATENATE(B15,C15),Qui!$D$301:$F$356,3,)),0)","v":0},11,null,null,0,{"$f":"IFERROR((VLOOKUP(CONCATENATE(P15,Q15),Qui!$D$301:$F$356,3,0)),0)","v":0}]
[12,null,null,null,null,null,null,null,null,null,null,null,{"$f":"SUM(D16:L16*(D16:L16>=LARGE(D16:L16,Qui!$A$402)))","v":{"$error":"#NUM!"}},{"$f":"IFERROR((VLOOKUP(CONCATENATE(B16,C16),Qui!$D$301:$F$356,3,)),0)","v":0},12,null,null,0,{"$f":"IFERROR((VLOOKUP(CONCATENATE(P16,Q16),Qui!$D$301:$F$356,3,0)),0)","v":0}]
[13,null,null,null,null,null,null,null,null,null,null,null,{"$f":"SUM(D17:L17*(D17:L17>=LARGE(D17:L17,Qui!$A$402)))","v":{"$error":"#NUM!"}},{"$f":"IFERROR((VLOOKUP(CONCATENATE(B17,C17),Qui!$D$301:$F$356,3,)),0)","v":0},13,null,null,0,{"$f":"IFERROR((VLOOKUP(CONCATENATE(P17,Q17),Qui!$D$301:$F$356,3,0)),0)","v":0}]
[14,null,null,null,null,null,null,null,null,null,null,null,{"$f":"SUM(D18:L18*(D18:L18>=LARGE(D18:L18,Qui!$A$402)))","v":{"$error":"#NUM!"}},{"$f":"IFERROR((VLOOKUP(CONCATENATE(B18,C18),Qui!$D$301:$F$356,3,)),0)","v":0},14,null,null,0,{"$f":"IFERROR((VLOOKUP(CONCATENATE(P18,Q18),Qui!$D$301:$F$356,3,0)),0)","v":0}]
[15,null,null,null,null,null,null,null,null,null,null,null,{"$f":"SUM(D19:L19*(D19:L19>=LARGE(D19:L19,Qui!$A$402)))","v":{"$error":"#NUM!"}},{"$f":"IFERROR((VLOOKUP(CONCATENATE(B19,C19),Qui!$D$301:$F$356,3,)),0)","v":0},15,null,null,0,{"$f":"IFERROR((VLOOKUP(CONCATENATE(P19,Q19),Qui!$D$301:$F$356,3,0)),0)","v":0}]
[16,null,null,null,null,null,null,null,null,null,null,null,{"$f":"SUM(D20:L20*(D20:L20>=LARGE(D20:L20,Qui!$A$402)))","v":{"$error":"#NUM!"}},{"$f":"IFERROR((VLOOKUP(CONCATENATE(B20,C20),Qui!$D$301:$F$356,3,)),0)","v":0},16,null,null,0,{"$f":"IFERROR((VLOOKUP(CONCATENATE(P20,Q20),Qui!$D$301:$F$356,3,0)),0)","v":0}]
[17,null,null,null,null,null,null,null,null,null,null,null,{"$f":"SUM(D21:L21*(D21:L21>=LARGE(D21:L21,Qui!$A$402)))","v":{"$error":"#NUM!"}},{"$f":"IFERROR((VLOOKUP(CONCATENATE(B21,C21),Qui!$D$301:$F$356,3,)),0)","v":0},17,null,null,0,{"$f":"IFERROR((VLOOKUP(CONCATENATE(P21,Q21),Qui!$D$301:$F$356,3,0)),0)","v":0}]
[18,null,null,null,null,null,null,null,null,null,null,null,{"$f":"SUM(D22:L22*(D22:L22>=LARGE(D22:L22,Qui!$A$402)))","v":{"$error":"#NUM!"}},{"$f":"IFERROR((VLOOKUP(CONCATENATE(B22,C22),Qui!$D$301:$F$356,3,)),0)","v":0},18,null,null,0,{"$f":"IFERROR((VLOOKUP(CONCATENATE(P22,Q22),Qui!$D$301:$F$356,3,0)),0)","v":0}]
[19,null,null,null,null,null,null,null,null,null,null,null,{"$f":"SUM(D23:L23*(D23:L23>=LARGE(D23:L23,Qui!$A$402)))","v":{"$error":"#NUM!"}},{"$f":"IFERROR((VLOOKUP(CONCATENATE(B23,C23),Qui!$D$301:$F$356,3,)),0)","v":0},19,null,null,0,{"$f":"IFERROR((VLOOKUP(CONCATENATE(P23,Q23),Qui!$D$301:$F$356,3,0)),0)","v":0}]
[20,null,null,null,null,null,null,null,null,null,null,null,{"$f":"SUM(D24:L24*(D24:L24>=LARGE(D24:L24,Qui!$A$402)))","v":{"$error":"#NUM!"}},{"$f":"IFERROR((VLOOKUP(CONCATENATE(B24,C24),Qui!$D$301:$F$356,3,)),0)","v":0},20,null,null,0,{"$f":"IFERROR((VLOOKUP(CONCATENATE(P24,Q24),Qui!$D$301:$F$356,3,0)),0)","v":0}]
[21,null,null,null,null,null,null,null,null,null,null,null,{"$f":"SUM(D25:L25*(D25:L25>=LARGE(D25:L25,Qui!$A$402)))","v":{"$error":"#NUM!"}},{"$f":"IFERROR((VLOOKUP(CONCATENATE(B25,C25),Qui!$D$301:$F$356,3,)),0)","v":0},21,null,null,0,{"$f":"IFERROR((VLOOKUP(CONCATENATE(P25,Q25),Qui!$D$301:$F$356,3,0)),0)","v":0}]
[22,null,null,null,null,null,null,null,null,null,null,null,{"$f":"SUM(D26:L26*(D26:L26>=LARGE(D26:L26,Qui!$A$402)))","v":{"$error":"#NUM!"}},{"$f":"IFERROR((VLOOKUP(CONCATENATE(B26,C26),Qui!$D$301:$F$356,3,)),0)","v":0},22,null,null,0,{"$f":"IFERROR((VLOOKUP(CONCATENATE(P26,Q26),Qui!$D$301:$F$356,3,0)),0)","v":0}]
[23,null,null,null,null,null,null,null,null,null,null,null,{"$f":"SUM(D27:L27*(D27:L27>=LARGE(D27:L27,Qui!$A$402)))","v":{"$error":"#NUM!"}},{"$f":"IFERROR((VLOOKUP(CONCATENATE(B27,C27),Qui!$D$301:$F$356,3,)),0)","v":0},23,null,null,0,{"$f":"IFERROR((VLOOKUP(CONCATENATE(P27,Q27),Qui!$D$301:$F$356,3,0)),0)","v":0}]
[24,null,null,null,null,null,null,null,null,null,null,null,{"$f":"SUM(D28:L28*(D28:L28>=LARGE(D28:L28,Qui!$A$402)))","v":{"$error":"#NUM!"}},{"$f":"IFERROR((VLOOKUP(CONCATENATE(B28,C28),Qui!$D$301:$F$356,3,)),0)","v":0},24,null,null,0,{"$f":"IFERROR((VLOOKUP(CONCATENATE(P28,Q28),Qui!$D$301:$F$356,3,0)),0)","v":0}]
[25,null,null,null,null,null,null,null,null,null,null,null,{"$f":"SUM(D29:L29*(D29:L29>=LARGE(D29:L29,Qui!$A$402)))","v":{"$error":"#NUM!"}},{"$f":"IFERROR((VLOOKUP(CONCATENATE(B29,C29),Qui!$D$301:$F$356,3,)),0)","v":0},25,null,null,0,{"$f":"IFERROR((VLOOKUP(CONCATENATE(P29,Q29),Qui!$D$301:$F$356,3,0)),0)","v":0}]
[26,null,null,null,null,null,null,null,null,null,null,null,{"$f":"SUM(D30:L30*(D30:L30>=LARGE(D30:L30,Qui!$A$402)))","v":{"$error":"#NUM!"}},{"$f":"IFERROR((VLOOKUP(CONCATENATE(B30,C30),Qui!$D$301:$F$356,3,)),0)","v":0},26,null,null,0,{"$f":"IFERROR((VLOOKUP(CONCATENATE(P30,Q30),Qui!$D$301:$F$356,3,0)),0)","v":0}]
[27,null,null,null,null,null,null,null,null,null,null,null,{"$f":"SUM(D31:L31*(D31:L31>=LARGE(D31:L31,Qui!$A$402)))","v":{"$error":"#NUM!"}},{"$f":"IFERROR((VLOOKUP(CONCATENATE(B31,C31),Qui!$D$301:$F$356,3,)),0)","v":0},27,null,null,0,{"$f":"IFERROR((VLOOKUP(CONCATENATE(P31,Q31),Qui!$D$301:$F$356,3,0)),0)","v":0}]
[28,null,null,null,null,null,null,null,null,null,null,null,{"$f":"SUM(D32:L32*(D32:L32>=LARGE(D32:L32,Qui!$A$402)))","v":{"$error":"#NUM!"}},{"$f":"IFERROR((VLOOKUP(CONCATENATE(B32,C32),Qui!$D$301:$F$356,3,)),0)","v":0},28,null,null,0,{"$f":"IFERROR((VLOOKUP(CONCATENATE(P32,Q32),Qui!$D$301:$F$356,3,0)),0)","v":0}]
[29,null,null,null,null,null,null,null,null,null,null,null,{"$f":"SUM(D33:L33*(D33:L33>=LARGE(D33:L33,Qui!$A$402)))","v":{"$error":"#NUM!"}},{"$f":"IFERROR((VLOOKUP(CONCATENATE(B33,C33),Qui!$D$301:$F$356,3,)),0)","v":0},29,null,null,0,{"$f":"IFERROR((VLOOKUP(CONCATENATE(P33,Q33),Qui!$D$301:$F$356,3,0)),0)","v":0}]
[30,null,null,null,null,null,null,null,null,null,null,null,{"$f":"SUM(D34:L34*(D34:L34>=LARGE(D34:L34,Qui!$A$402)))","v":{"$error":"#NUM!"}},{"$f":"IFERROR((VLOOKUP(CONCATENATE(B34,C34),Qui!$D$301:$F$356,3,)),0)","v":0},30,null,null,0,{"$f":"IFERROR((VLOOKUP(CONCATENATE(P34,Q34),Qui!$D$301:$F$356,3,0)),0)","v":0}]
[31,null,null,null,null,null,null,null,null,null,null,null,{"$f":"SUM(D35:L35*(D35:L35>=LARGE(D35:L35,Qui!$A$402)))","v":{"$error":"#NUM!"}},{"$f":"IFERROR((VLOOKUP(CONCATENATE(B35,C35),Qui!$D$301:$F$356,3,)),0)","v":0},31,null,null,0,{"$f":"IFERROR((VLOOKUP(CONCATENATE(P35,Q35),Qui!$D$301:$F$356,3,0)),0)","v":0}]
[32,null,null,null,null,null,null,null,null,null,null,null,{"$f":"SUM(D36:L36*(D36:L36>=LARGE(D36:L36,Qui!$A$402)))","v":{"$error":"#NUM!"}},{"$f":"IFERROR((VLOOKUP(CONCATENATE(B36,C36),Qui!$D$301:$F$356,3,)),0)","v":0},32,null,null,0,{"$f":"IFERROR((VLOOKUP(CONCATENATE(P36,Q36),Qui!$D$301:$F$356,3,0)),0)","v":0}]
[33,null,null,null,null,null,null,null,null,null,null,null,{"$f":"SUM(D37:L37*(D37:L37>=LARGE(D37:L37,Qui!$A$402)))","v":{"$error":"#NUM!"}},{"$f":"IFERROR((VLOOKUP(CONCATENATE(B37,C37),Qui!$D$301:$F$356,3,)),0)","v":0},33,null,null,0,{"$f":"IFERROR((VLOOKUP(CONCATENATE(P37,Q37),Qui!$D$301:$F$356,3,0)),0)","v":0}]
[34,null,null,null,null,null,null,null,null,null,null,null,{"$f":"SUM(D38:L38*(D38:L38>=LARGE(D38:L38,Qui!$A$402)))","v":{"$error":"#NUM!"}},{"$f":"IFERROR((VLOOKUP(CONCATENATE(B38,C38),Qui!$D$301:$F$356,3,)),0)","v":0},34,null,null,0,{"$f":"IFERROR((VLOOKUP(CONCATENATE(P38,Q38),Qui!$D$301:$F$356,3,0)),0)","v":0}]
[35,null,null,null,null,null,null,null,null,null,null,null,{"$f":"SUM(D39:L39*(D39:L39>=LARGE(D39:L39,Qui!$A$402)))","v":{"$error":"#NUM!"}},{"$f":"IFERROR((VLOOKUP(CONCATENATE(B39,C39),Qui!$D$301:$F$356,3,)),0)","v":0},35,null,null,0,{"$f":"IFERROR((VLOOKUP(CONCATENATE(P39,Q39),Qui!$D$301:$F$356,3,0)),0)","v":0}]
[36,null,null,0,0,0,0,0,0,0,0,0,{"$f":"SUM(D40:L40*(D40:L40>=LARGE(D40:L40,Qui!$A$402)))","v":0},{"$f":"IFERROR((VLOOKUP(CONCATENATE(B40,C40),Qui!$D$301:$F$356,3,)),0)","v":0},36,null,null,0,{"$f":"IFERROR((VLOOKUP(CONCATENATE(P40,Q40),Qui!$D$301:$F$356,3,0)),0)","v":0}]
[37,null,null,0,0,0,0,0,0,0,0,0,{"$f":"SUM(D41:L41*(D41:L41>=LARGE(D41:L41,Qui!$A$402)))","v":0},{"$f":"IFERROR((VLOOKUP(CONCATENATE(B41,C41),Qui!$D$301:$F$356,3,)),0)","v":0},37,null,null,0,{"$f":"IFERROR((VLOOKUP(CONCATENATE(P41,Q41),Qui!$D$301:$F$356,3,0)),0)","v":0}]
[38,null,null,0,0,0,0,0,0,0,0,0,{"$f":"SUM(D42:L42*(D42:L42>=LARGE(D42:L42,Qui!$A$402)))","v":0},{"$f":"IFERROR((VLOOKUP(CONCATENATE(B42,C42),Qui!$D$301:$F$356,3,)),0)","v":0},38,null,null,0,{"$f":"IFERROR((VLOOKUP(CONCATENATE(P42,Q42),Qui!$D$301:$F$356,3,0)),0)","v":0}]
[39,null,null,0,0,0,0,0,0,0,0,0,{"$f":"SUM(D43:L43*(D43:L43>=LARGE(D43:L43,Qui!$A$402)))","v":0},{"$f":"IFERROR((VLOOKUP(CONCATENATE(B43,C43),Qui!$D$301:$F$356,3,)),0)","v":0},39,null,null,0,{"$f":"IFERROR((VLOOKUP(CONCATENATE(P43,Q43),Qui!$D$301:$F$356,3,0)),0)","v":0}]
[40,null,null,0,0,0,0,0,0,0,0,0,{"$f":"SUM(D44:L44*(D44:L44>=LARGE(D44:L44,Qui!$A$402)))","v":0},{"$f":"IFERROR((VLOOKUP(CONCATENATE(B44,C44),Qui!$D$301:$F$356,3,)),0)","v":0},40,null,null,0,{"$f":"IFERROR((VLOOKUP(CONCATENATE(P44,Q44),Qui!$D$301:$F$356,3,0)),0)","v":0}]
[41,null,null,0,0,0,0,0,0,0,0,0,{"$f":"SUM(D45:L45*(D45:L45>=LARGE(D45:L45,Qui!$A$402)))","v":0},{"$f":"IFERROR((VLOOKUP(CONCATENATE(B45,C45),Qui!$D$301:$F$356,3,)),0)","v":0},41,null,null,0,{"$f":"IFERROR((VLOOKUP(CONCATENATE(P45,Q45),Qui!$D$301:$F$356,3,0)),0)","v":0}]
[42,null,null,0,0,0,0,0,0,0,0,0,{"$f":"SUM(D46:L46*(D46:L46>=LARGE(D46:L46,Qui!$A$402)))","v":0},{"$f":"IFERROR((VLOOKUP(CONCATENATE(B46,C46),Qui!$D$301:$F$356,3,)),0)","v":0},42,null,null,0,{"$f":"IFERROR((VLOOKUP(CONCATENATE(P46,Q46),Qui!$D$301:$F$356,3,0)),0)","v":0}]
[43,null,null,0,0,0,0,0,0,0,0,0,{"$f":"SUM(D47:L47*(D47:L47>=LARGE(D47:L47,Qui!$A$402)))","v":0},{"$f":"IFERROR((VLOOKUP(CONCATENATE(B47,C47),Qui!$D$301:$F$356,3,)),0)","v":0},43,null,null,0,{"$f":"IFERROR((VLOOKUP(CONCATENATE(P47,Q47),Qui!$D$301:$F$356,3,0)),0)","v":0}]
[44,null,null,0,0,0,0,0,0,0,0,0,{"$f":"SUM(D48:L48*(D48:L48>=LARGE(D48:L48,Qui!$A$402)))","v":0},{"$f":"IFERROR((VLOOKUP(CONCATENATE(B48,C48),Qui!$D$301:$F$356,3,)),0)","v":0},44,null,null,0,{"$f":"IFERROR((VLOOKUP(CONCATENATE(P48,Q48),Qui!$D$301:$F$356,3,0)),0)","v":0}]
[45,null,null,0,0,0,0,0,0,0,0,0,{"$f":"SUM(D49:L49*(D49:L49>=LARGE(D49:L49,Qui!$A$402)))","v":0},{"$f":"IFERROR((VLOOKUP(CONCATENATE(B49,C49),Qui!$D$301:$F$356,3,)),0)","v":0},45,null,null,0,{"$f":"IFERROR((VLOOKUP(CONCATENATE(P49,Q49),Qui!$D$301:$F$356,3,0)),0)","v":0}]
[46,null,null,0,0,0,0,0,0,0,0,0,{"$f":"SUM(D50:L50*(D50:L50>=LARGE(D50:L50,Qui!$A$402)))","v":0},{"$f":"IFERROR((VLOOKUP(CONCATENATE(B50,C50),Qui!$D$301:$F$356,3,)),0)","v":0},46,null,null,0,{"$f":"IFERROR((VLOOKUP(CONCATENATE(P50,Q50),Qui!$D$301:$F$356,3,0)),0)","v":0}]
[47,null,null,0,0,0,0,0,0,0,0,0,{"$f":"SUM(D51:L51*(D51:L51>=LARGE(D51:L51,Qui!$A$402)))","v":0},{"$f":"IFERROR((VLOOKUP(CONCATENATE(B51,C51),Qui!$D$301:$F$356,3,)),0)","v":0},47,null,null,0,{"$f":"IFERROR((VLOOKUP(CONCATENATE(P51,Q51),Qui!$D$301:$F$356,3,0)),0)","v":0}]
[48,null,null,0,0,0,0,0,0,0,0,0,{"$f":"SUM(D52:L52*(D52:L52>=LARGE(D52:L52,Qui!$A$402)))","v":0},{"$f":"IFERROR((VLOOKUP(CONCATENATE(B52,C52),Qui!$D$301:$F$356,3,)),0)","v":0},48,null,null,0,{"$f":"IFERROR((VLOOKUP(CONCATENATE(P52,Q52),Qui!$D$301:$F$356,3,0)),0)","v":0}]
[49,null,null,0,0,0,0,0,0,0,0,0,{"$f":"SUM(D53:L53*(D53:L53>=LARGE(D53:L53,Qui!$A$402)))","v":0},{"$f":"IFERROR((VLOOKUP(CONCATENATE(B53,C53),Qui!$D$301:$F$356,3,)),0)","v":0},49,null,null,0,{"$f":"IFERROR((VLOOKUP(CONCATENATE(P53,Q53),Qui!$D$301:$F$356,3,0)),0)","v":0}]
[50,null,null,0,0,0,0,0,0,0,0,0,{"$f":"SUM(D54:L54*(D54:L54>=LARGE(D54:L54,Qui!$A$402)))","v":0},{"$f":"IFERROR((VLOOKUP(CONCATENATE(B54,C54),Qui!$D$301:$F$356,3,)),0)","v":0},50,null,null,0,{"$f":"IFERROR((VLOOKUP(CONCATENATE(P54,Q54),Qui!$D$301:$F$356,3,0)),0)","v":0}]
[51,null,null,0,0,0,0,0,0,0,0,0,{"$f":"SUM(D55:L55*(D55:L55>=LARGE(D55:L55,Qui!$A$402)))","v":0},{"$f":"IFERROR((VLOOKUP(CONCATENATE(B55,C55),Qui!$D$301:$F$356,3,)),0)","v":0},51,null,null,0,{"$f":"IFERROR((VLOOKUP(CONCATENATE(P55,Q55),Qui!$D$301:$F$356,3,0)),0)","v":0}]
[52,null,null,0,0,0,0,0,0,0,0,0,{"$f":"SUM(D56:L56*(D56:L56>=LARGE(D56:L56,Qui!$A$402)))","v":0},{"$f":"IFERROR((VLOOKUP(CONCATENATE(B56,C56),Qui!$D$301:$F$356,3,)),0)","v":0},52,null,null,0,{"$f":"IFERROR((VLOOKUP(CONCATENATE(P56,Q56),Qui!$D$301:$F$356,3,0)),0)","v":0}]
[53,null,null,null,0,0,0,0,0,0,0,0,{"$f":"SUM(D57:L57*(D57:L57>=LARGE(D57:L57,Qui!$A$402)))","v":0},{"$f":"IFERROR((VLOOKUP(CONCATENATE(B57,C57),Qui!$D$301:$F$356,3,)),0)","v":0},53,null,null,0,{"$f":"IFERROR((VLOOKUP(CONCATENATE(P57,Q57),Qui!$D$301:$F$356,3,0)),0)","v":0}]
[54,null,null,null,0,0,0,0,0,0,0,0,{"$f":"SUM(D58:L58*(D58:L58>=LARGE(D58:L58,Qui!$A$402)))","v":0},{"$f":"IFERROR((VLOOKUP(CONCATENATE(B58,C58),Qui!$D$301:$F$356,3,)),0)","v":0},54,null,null,0,{"$f":"IFERROR((VLOOKUP(CONCATENATE(P58,Q58),Qui!$D$301:$F$356,3,0)),0)","v":0}]
[null,null,null,{"$f":"MAX(D5:D58)","v":0},null,{"$f":"MAX(F5:F58)","v":0},{"$f":"MAX(G5:G58)","v":0},null,{"$f":"MAX(I5:I58)","v":0},{"$f":"MAX(J5:J58)","v":0},{"$f":"MAX(K5:K58)","v":0},{"$f":"MAX(L5:L58)","v":0}]
["Classement général par équipe",null,null,null,null,null,null,null,null,null,null,null,null,null,"Classement par équipe"]
[]
[1,null,null,null,null,null,null,null,null,null,null,null,{"$f":"SUM(D62:L62)","v":0},{"$f":"VLOOKUP(B62,Qui!$A$201:$D$204,4)","v":{"$error":"#N/A"}},1,null,null,0,{"$f":"VLOOKUP(P62,Qui!$A$201:$D$204,4)","v":{"$error":"#N/A"}}]
[2,null,null,null,null,null,null,null,null,null,null,null,0,{"$f":"VLOOKUP(B63,Qui!$A$201:$D$204,4)","v":{"$error":"#N/A"}},2,null,null,0,{"$f":"VLOOKUP(P63,Qui!$A$201:$D$204,4)","v":{"$error":"#N/A"}}]
[3,null,null,null,null,null,null,null,null,null,null,null,0,{"$f":"VLOOKUP(B64,Qui!$A$201:$D$204,4)","v":{"$error":"#N/A"}},3,null,null,0,{"$f":"VLOOKUP(P64,Qui!$A$201:$D$204,4)","v":{"$error":"#N/A"}}]
[4,null,null,null,null,null,null,null,null,null,null,null,0,{"$f":"VLOOKUP(B65,Qui!$A$201:$D$204,4)","v":{"$error":"#N/A"}},4,null,null,0,{"$f":"VLOOKUP(P65,Qui!$A$201:$D$204,4)","v":{"$error":"#N/A"}}]
[5,null,null,null,435,{"$error":"#N/A"},{"$error":"#N/A"},{"$error":"#N/A"},null,null,null,null,{"$error":"#N/A"},{"$f":"VLOOKUP(B66,Qui!$A$201:$D$204,4)","v":{"$error":"#N/A"}},5,null,null,{"$f":"SUMPRODUCT(((($S$5:$S$58=S66)*$R$5:$R$58*1))*((($S$5:$S$58=S66)*$R$5:$R$58*1)>=LARGE((($S$5:$S$58=S66)*$R$5:$R$58*1),Qui!$B$402)))","v":{"$error":"#N/A"}},{"$f":"VLOOKUP(P66,Qui!$A$201:$D$204,4)","v":{"$error":"#N/A"}}]
[6,null,null,null,435,{"$error":"#N/A"},{"$error":"#N/A"},{"$error":"#N/A"},null,null,null,null,{"$error":"#N/A"},{"$f":"VLOOKUP(B67,Qui!$A$201:$D$204,4)","v":{"$error":"#N/A"}},6,null,null,{"$f":"SUMPRODUCT(((($S$5:$S$58=S67)*$R$5:$R$58*1))*((($S$5:$S$58=S67)*$R$5:$R$58*1)>=LARGE((($S$5:$S$58=S67)*$R$5:$R$58*1),Qui!$B$402)))","v":{"$error":"#N/A"}},{"$f":"VLOOKUP(P67,Qui!$A$201:$D$204,4)","v":{"$error":"#N/A"}}]
[null,null,null,{"$f":"MAX(D62:D67)","v":0},null,{"$f":"MAX(F62:F67)","v":{"$error":"#N/A"}},{"$f":"MAX(G62:G67)","v":{"$error":"#N/A"}},null,{"$f":"MAX(I62:I67)","v":0},{"$f":"MAX(J62:J67)","v":0},{"$f":"MAX(K62:K67)","v":0},{"$f":"MAX(L62:L67)","v":0},null,null,null,null,null,0]
[null,null,null,null,null,null,null,null,null,null,null,null,"La Chaux-de-Fonds, le 17 novembre 2019, CM / DP"]
[]
[null,{"$f":"CONCATENATE(\"Rappels :\")","v":"Rappels :"}]
[]
[null,{"$f":"CONCATENATE(\"a) le classement général par équipe  est fait sur le cumul des \",Qui!$B$402,\" meilleurs résultats individuels de chaque manche\")","v":"a) le classement général par équipe  est fait sur le cumul des 5 meilleurs résultats individuels de chaque manche"}]
[null,{"$f":"CONCATENATE(\"b) le classement général individuel est fait sur le cumul des \",Qui!$A$402,\" meilleurs résultats individuels\")","v":"b) le classement général individuel est fait sur le cumul des 5 meilleurs résultats individuels"}]
[]
[]
[]
[]
[]
[]
[]
[]
[]
[]
[]
[]
[]
[]
[]
[]
[]
[]
[]
[]
[]
[]
[]
[]
[]
[]
[]
[]
[]
[]
[]
[]
[]
[]
[]
[]
[]
[]
[]
[]
[]
[]
[]
[]
[]
[]
[]
[]
[]
[]
[]
[]
[]
[]
[]
[]
[]
[]
[]
[]
[]
[]
[]
[]
[]
[]
[]
[]
[]
[]
[]
[]
[]
[]
[]
[]
[]
[]
[]
[]
[]
[]
[]
[]
[]
[]
[]
[]
[]
[]
[]
[]
[]
[]
[]
[]
[]
[]
[]
[]
[]
[]
[]
[]
[]
[]
[]
[]
[]
[]
[]
[]
[]
[]
[]
[]
[]
[]
[]
[]
[]
[]
[]
[]
[null,null,null,null,null,"Duplicata Colonne A\ntechnique"]

{"sheet":"Manche_6","index":8,"n_rows":74,"n_cols":21,"rows_kept":74,"cut":false,"hidden":true,"merged":[[73,1,73,17],[0,0,0,17],[1,0,1,17],[2,0,2,1],[2,15,2,17],[3,15,3,17],[60,1,60,2],[60,15,60,16],[67,1,67,2],[68,12,68,17],[70,1,70,17],[71,1,71,17],[72,1,72,17]]}
["Association intercantonale \ndes joueurs de boules\nGrand Jeu Neuchâtelois"]
[{"$f":"CONCATENATE(\"Championnat grand jeu neuchâtelois \",YEAR(Calendrier!B6))","v":"Championnat grand jeu neuchâtelois 2020"}]
["Classement général individuel",null,"Manches",{"$f":"Calendrier!F40","v":"Le Locle"},{"$f":"Calendrier!F47","v":"Grand-Sommartel"},{"$f":"Calendrier!F54","v":"L'Epi"},{"$f":"Calendrier!F61","v":"La  Chaux-de-Fonds"},{"$f":"Calendrier!F68","v":"Evologia"},{"$f":"Calendrier!F75","v":"La  Vue-des-Alpes"},{"$f":"Calendrier!F82","v":"00:00:00"},null,null,{"$f":"CONCATENATE(\"Général\",CHAR(10),\"les \",Qui!$A$402,\" meilleurs\")","v":"Général\nles 5 meilleurs"},null,null,{"$f":"CONCATENATE(\"Classement de la manche\",CHAR(10),Calendrier!F75,CHAR(10),\"du\",TEXT(Calendrier!F77,\" jj.mm\"),\" au\",TEXT(Calendrier!F80,\" jj.mm.aaaa\"))","v":"Classement de la manche\nLa  Vue-des-Alpes\ndu 09.11 au 12.11.2020"},null,null,null,null,{"$f":"CONCATENATE(TEXT(Calendrier!F77,\" jj.mm\"),\" au\",TEXT(Calendrier!F80,\" jj.mm.aaaa\"))","v":" 09.11 au 12.11.2020"}]
[null,null,null,1,2,3,4,5,6,7,8,9,null,null,null,{"$f":"CONCATENATE(\"Champion de jeu : \",CHAR(10),P5,\" \",Q5)","v":"Champion de jeu : \n "}]
[1,null,null,null,null,null,null,null,null,null,null,null,{"$f":"SUM(D5:L5*(D5:L5>=LARGE(D5:L5,Qui!$A$402)))","v":{"$error":"#NUM!"}},{"$f":"IFERROR((VLOOKUP(CONCATENATE(B5,C5),Qui!$D$301:$F$356,3,)),0)","v":0},1,null,null,0,{"$f":"IFERROR((VLOOKUP(CONCATENATE(P5,Q5),Qui!$D$301:$F$356,3,0)),0)","v":0}]
[2,null,null,null,null,null,null,null,null,null,null,null,{"$f":"SUM(D6:L6*(D6:L6>=LARGE(D6:L6,Qui!$A$402)))","v":{"$error":"#NUM!"}},{"$f":"IFERROR((VLOOKUP(CONCATENATE(B6,C6),Qui!$D$301:$F$356,3,)),0)","v":0},2,null,null,0,{"$f":"IFERROR((VLOOKUP(CONCATENATE(P6,Q6),Qui!$D$301:$F$356,3,0)),0)","v":0}]
[3,null,null,null,null,null,null,null,null,null,null,null,{"$f":"SUM(D7:L7*(D7:L7>=LARGE(D7:L7,Qui!$A$402)))","v":{"$error":"#NUM!"}},{"$f":"IFERROR((VLOOKUP(CONCATENATE(B7,C7),Qui!$D$301:$F$356,3,)),0)","v":0},3,null,null,0,{"$f":"IFERROR((VLOOKUP(CONCATENATE(P7,Q7),Qui!$D$301:$F$356,3,0)),0)","v":0}]
[4,null,null,null,null,null,null,null,null,null,null,null,{"$f":"SUM(D8:L8*(D8:L8>=LARGE(D8:L8,Qui!$A$402)))","v":{"$error":"#NUM!"}},{"$f":"IFERROR((VLOOKUP(CONCATENATE(B8,C8),Qui!$D$301:$F$356,3,)),0)","v":0},4,null,null,0,{"$f":"IFERROR((VLOOKUP(CONCATENATE(P8,Q8),Qui!$D$301:$F$356,3,0)),0)","v":0}]
[5,null,null,null,null,null,null,null,null,null,null,null,{"$f":"SUM(D9:L9*(D9:L9>=LARGE(D9:L9,Qui!$A$402)))","v":{"$error":"#NUM!"}},{"$f":"IFERROR((VLOOKUP(CONCATENATE(B9,C9),Qui!$D$301:$F$356,3,)),0)","v":0},5,null,null,0,{"$f":"IFERROR((VLOOKUP(CONCATENATE(P9,Q9),Qui!$D$301:$F$356,3,0)),0)","v":0}]
[6,null,null,null,null,null,null,null,null,null,null,null,{"$f":"SUM(D10:L10*(D10:L10>=LARGE(D10:L10,Qui!$A$402)))","v":{"$error":"#NUM!"}},{"$f":"IFERROR((VLOOKUP(CONCATENATE(B10,C10),Qui!$D$301:$F$356,3,)),0)","v":0},6,null,null,0,{"$f":"IFERROR((VLOOKUP(CONCATENATE(P10,Q10),Qui!$D$301:$F$356,3,0)),0)","v":0}]
[7,null,null,null,null,null,null,null,null,null,null,null,{"$f":"SUM(D11:L11*(D11:L11>=LARGE(D11:L11,Qui!$A$402)))","v":{"$error":"#NUM!"}},{"$f":"IFERROR((VLOOKUP(CONCATENATE(B11,C11),Qui!$D$301:$F$356,3,)),0)","v":0},7,null,null,0,{"$f":"IFERROR((VLOOKUP(CONCATENATE(P11,Q11),Qui!$D$301:$F$356,3,0)),0)","v":0}]
[8,null,null,null,null,null,null,null,null,null,null,null,{"$f":"SUM(D12:L12*(D12:L12>=LARGE(D12:L12,Qui!$A$402)))","v":{"$error":"#NUM!"}},{"$f":"IFERROR((VLOOKUP(CONCATENATE(B12,C12),Qui!$D$301:$F$356,3,)),0)","v":0},8,null,null,0,{"$f":"IFERROR((VLOOKUP(CONCATENATE(P12,Q12),Qui!$D$301:$F$356,3,0)),0)","v":0}]
[9,null,null,null,null,null,null,null,null,null,null,null,{"$f":"SUM(D13:L13*(D13:L13>=LARGE(D13:L13,Qui!$A$402)))","v":{"$error":"#NUM!"}},{"$f":"IFERROR((VLOOKUP(CONCATENATE(B13,C13),Qui!$D$301:$F$356,3,)),0)","v":0},9,null,null,0,{"$f":"IFERROR((VLOOKUP(CONCATENATE(P13,Q13),Qui!$D$301:$F$356,3,0)),0)","v":0}]
[10,null,null,null,null,null,null,null,null,null,null,null,{"$f":"SUM(D14:L14*(D14:L14>=LARGE(D14:L14,Qui!$A$402)))","v":{"$error":"#NUM!"}},{"$f":"IFERROR((VLOOKUP(CONCATENATE(B14,C14),Qui!$D$301:$F$356,3,)),0)","v":0},10,null,null,0,{"$f":"IFERROR((VLOOKUP(CONCATENATE(P14,Q14),Qui!$D$301:$F$356,3,0)),0)","v":0}]
[11,null,null,null,null,null,null,null,null,null,null,null,{"$f":"SUM(D15:L15*(D15:L15>=LARGE(D15:L15,Qui!$A$402)))","v":{"$error":"#NUM!"}},{"$f":"IFERROR((VLOOKUP(CONCATENATE(B15,C15),Qui!$D$301:$F$356,3,)),0)","v":0},11,null,null,0,{"$f":"IFERROR((VLOOKUP(CONCATENATE(P15,Q15),Qui!$D$301:$F$356,3,0)),0)","v":0}]
[12,null,null,null,null,null,null,null,null,null,null,null,{"$f":"SUM(D16:L16*(D16:L16>=LARGE(D16:L16,Qui!$A$402)))","v":{"$error":"#NUM!"}},{"$f":"IFERROR((VLOOKUP(CONCATENATE(B16,C16),Qui!$D$301:$F$356,3,)),0)","v":0},12,null,null,0,{"$f":"IFERROR((VLOOKUP(CONCATENATE(P16,Q16),Qui!$D$301:$F$356,3,0)),0)","v":0}]
[13,null,null,null,null,null,null,null,null,null,null,null,{"$f":"SUM(D17:L17*(D17:L17>=LARGE(D17:L17,Qui!$A$402)))","v":{"$error":"#NUM!"}},{"$f":"IFERROR((VLOOKUP(CONCATENATE(B17,C17),Qui!$D$301:$F$356,3,)),0)","v":0},13,null,null,0,{"$f":"IFERROR((VLOOKUP(CONCATENATE(P17,Q17),Qui!$D$301:$F$356,3,0)),0)","v":0}]
[14,null,null,null,null,null,null,null,null,null,null,null,{"$f":"SUM(D18:L18*(D18:L18>=LARGE(D18:L18,Qui!$A$402)))","v":{"$error":"#NUM!"}},{"$f":"IFERROR((VLOOKUP(CONCATENATE(B18,C18),Qui!$D$301:$F$356,3,)),0)","v":0},14,null,null,0,{"$f":"IFERROR((VLOOKUP(CONCATENATE(P18,Q18),Qui!$D$301:$F$356,3,0)),0)","v":0}]
[15,null,null,null,null,null,null,null,null,null,null,null,{"$f":"SUM(D19:L19*(D19:L19>=LARGE(D19:L19,Qui!$A$402)))","v":{"$error":"#NUM!"}},{"$f":"IFERROR((VLOOKUP(CONCATENATE(B19,C19),Qui!$D$301:$F$356,3,)),0)","v":0},15,null,null,0,{"$f":"IFERROR((VLOOKUP(CONCATENATE(P19,Q19),Qui!$D$301:$F$356,3,0)),0)","v":0}]
[16,null,null,null,null,null,null,null,null,null,null,null,{"$f":"SUM(D20:L20*(D20:L20>=LARGE(D20:L20,Qui!$A$402)))","v":{"$error":"#NUM!"}},{"$f":"IFERROR((VLOOKUP(CONCATENATE(B20,C20),Qui!$D$301:$F$356,3,)),0)","v":0},16,null,null,0,{"$f":"IFERROR((VLOOKUP(CONCATENATE(P20,Q20),Qui!$D$301:$F$356,3,0)),0)","v":0}]
[17,null,null,null,null,null,null,null,null,null,null,null,{"$f":"SUM(D21:L21*(D21:L21>=LARGE(D21:L21,Qui!$A$402)))","v":{"$error":"#NUM!"}},{"$f":"IFERROR((VLOOKUP(CONCATENATE(B21,C21),Qui!$D$301:$F$356,3,)),0)","v":0},17,null,null,0,{"$f":"IFERROR((VLOOKUP(CONCATENATE(P21,Q21),Qui!$D$301:$F$356,3,0)),0)","v":0}]
[18,null,null,null,null,null,null,null,null,null,null,null,{"$f":"SUM(D22:L22*(D22:L22>=LARGE(D22:L22,Qui!$A$402)))","v":{"$error":"#NUM!"}},{"$f":"IFERROR((VLOOKUP(CONCATENATE(B22,C22),Qui!$D$301:$F$356,3,)),0)","v":0},18,null,null,0,{"$f":"IFERROR((VLOOKUP(CONCATENATE(P22,Q22),Qui!$D$301:$F$356,3,0)),0)","v":0}]
[19,null,null,null,null,null,null,null,null,null,null,null,{"$f":"SUM(D23:L23*(D23:L23>=LARGE(D23:L23,Qui!$A$402)))","v":{"$error":"#NUM!"}},{"$f":"IFERROR((VLOOKUP(CONCATENATE(B23,C23),Qui!$D$301:$F$356,3,)),0)","v":0},19,null,null,0,{"$f":"IFERROR((VLOOKUP(CONCATENATE(P23,Q23),Qui!$D$301:$F$356,3,0)),0)","v":0}]
[20,null,null,null,null,null,null,null,null,null,null,null,{"$f":"SUM(D24:L24*(D24:L24>=LARGE(D24:L24,Qui!$A$402)))","v":{"$error":"#NUM!"}},{"$f":"IFERROR((VLOOKUP(CONCATENATE(B24,C24),Qui!$D$301:$F$356,3,)),0)","v":0},20,null,null,0,{"$f":"IFERROR((VLOOKUP(CONCATENATE(P24,Q24),Qui!$D$301:$F$356,3,0)),0)","v":0}]
[21,null,null,null,null,null,null,null,null,null,null,null,{"$f":"SUM(D25:L25*(D25:L25>=LARGE(D25:L25,Qui!$A$402)))","v":{"$error":"#NUM!"}},{"$f":"IFERROR((VLOOKUP(CONCATENATE(B25,C25),Qui!$D$301:$F$356,3,)),0)","v":0},21,null,null,0,{"$f":"IFERROR((VLOOKUP(CONCATENATE(P25,Q25),Qui!$D$301:$F$356,3,0)),0)","v":0}]
[22,null,null,null,null,null,null,null,null,null,null,null,{"$f":"SUM(D26:L26*(D26:L26>=LARGE(D26:L26,Qui!$A$402)))","v":{"$error":"#NUM!"}},{"$f":"IFERROR((VLOOKUP(CONCATENATE(B26,C26),Qui!$D$301:$F$356,3,)),0)","v":0},22,null,null,0,{"$f":"IFERROR((VLOOKUP(CONCATENATE(P26,Q26),Qui!$D$301:$F$356,3,0)),0)","v":0}]
[23,null,null,null,null,null,null,null,null,null,null,null,{"$f":"SUM(D27:L27*(D27:L27>=LARGE(D27:L27,Qui!$A$402)))","v":{"$error":"#NUM!"}},{"$f":"IFERROR((VLOOKUP(CONCATENATE(B27,C27),Qui!$D$301:$F$356,3,)),0)","v":0},23,null,null,0,{"$f":"IFERROR((VLOOKUP(CONCATENATE(P27,Q27),Qui!$D$301:$F$356,3,0)),0)","v":0}]
[24,null,null,null,null,null,null,null,null,null,null,null,{"$f":"SUM(D28:L28*(D28:L28>=LARGE(D28:L28,Qui!$A$402)))","v":{"$error":"#NUM!"}},{"$f":"IFERROR((VLOOKUP(CONCATENATE(B28,C28),Qui!$D$301:$F$356,3,)),0)","v":0},24,null,null,0,{"$f":"IFERROR((VLOOKUP(CONCATENATE(P28,Q28),Qui!$D$301:$F$356,3,0)),0)","v":0}]
[25,null,null,null,null,null,null,null,null,null,null,null,{"$f":"SUM(D29:L29*(D29:L29>=LARGE(D29:L29,Qui!$A$402)))","v":{"$error":"#NUM!"}},{"$f":"IFERROR((VLOOKUP(CONCATENATE(B29,C29),Qui!$D$301:$F$356,3,)),0)","v":0},25,null,null,0,{"$f":"IFERROR((VLOOKUP(CONCATENATE(P29,Q29),Qui!$D$301:$F$356,3,0)),0)","v":0}]
[26,null,null,null,null,null,null,null,null,null,null,null,{"$f":"SUM(D30:L30*(D30:L30>=LARGE(D30:L30,Qui!$A$402)))","v":{"$error":"#NUM!"}},{"$f":"IFERROR((VLOOKUP(CONCATENATE(B30,C30),Qui!$D$301:$F$356,3,)),0)","v":0},26,null,null,0,{"$f":"IFERROR((VLOOKUP(CONCATENATE(P30,Q30),Qui!$D$301:$F$356,3,0)),0)","v":0}]
[27,null,null,null,null,null,null,null,null,null,null,null,{"$f":"SUM(D31:L31*(D31:L31>=LARGE(D31:L31,Qui!$A$402)))","v":{"$error":"#NUM!"}},{"$f":"IFERROR((VLOOKUP(CONCATENATE(B31,C31),Qui!$D$301:$F$356,3,)),0)","v":0},27,null,null,0,{"$f":"IFERROR((VLOOKUP(CONCATENATE(P31,Q31),Qui!$D$301:$F$356,3,0)),0)","v":0}]
[28,null,null,null,null,null,null,null,null,null,null,null,{"$f":"SUM(D32:L32*(D32:L32>=LARGE(D32:L32,Qui!$A$402)))","v":{"$error":"#NUM!"}},{"$f":"IFERROR((VLOOKUP(CONCATENATE(B32,C32),Qui!$D$301:$F$356,3,)),0)","v":0},28,null,null,0,{"$f":"IFERROR((VLOOKUP(CONCATENATE(P32,Q32),Qui!$D$301:$F$356,3,0)),0)","v":0}]
[29,null,null,null,null,null,null,null,null,null,null,null,{"$f":"SUM(D33:L33*(D33:L33>=LARGE(D33:L33,Qui!$A$402)))","v":{"$error":"#NUM!"}},{"$f":"IFERROR((VLOOKUP(CONCATENATE(B33,C33),Qui!$D$301:$F$356,3,)),0)","v":0},29,null,null,0,{"$f":"IFERROR((VLOOKUP(CONCATENATE(P33,Q33),Qui!$D$301:$F$356,3,0)),0)","v":0}]
[30,null,null,null,null,null,null,null,null,null,null,null,{"$f":"SUM(D34:L34*(D34:L34>=LARGE(D34:L34,Qui!$A$402)))","v":{"$error":"#NUM!"}},{"$f":"IFERROR((VLOOKUP(CONCATENATE(B34,C34),Qui!$D$301:$F$356,3,)),0)","v":0},30,null,null,0,{"$f":"IFERROR((VLOOKUP(CONCATENATE(P34,Q34),Qui!$D$301:$F$356,3,0)),0)","v":0}]
[31,null,null,null,null,null,null,null,null,null,null,null,{"$f":"SUM(D35:L35*(D35:L35>=LARGE(D35:L35,Qui!$A$402)))","v":{"$error":"#NUM!"}},{"$f":"IFERROR((VLOOKUP(CONCATENATE(B35,C35),Qui!$D$301:$F$356,3,)),0)","v":0},31,null,null,0,{"$f":"IFERROR((VLOOKUP(CONCATENATE(P35,Q35),Qui!$D$301:$F$356,3,0)),0)","v":0}]
[32,null,null,null,null,null,null,null,null,null,null,null,{"$f":"SUM(D36:L36*(D36:L36>=LARGE(D36:L36,Qui!$A$402)))","v":{"$error":"#NUM!"}},{"$f":"IFERROR((VLOOKUP(CONCATENATE(B36,C36),Qui!$D$301:$F$356,3,)),0)","v":0},32,null,null,0,{"$f":"IFERROR((VLOOKUP(CONCATENATE(P36,Q36),Qui!$D$301:$F$356,3,0)),0)","v":0}]
[33,null,null,null,null,null,null,null,null,null,null,null,{"$f":"SUM(D37:L37*(D37:L37>=LARGE(D37:L37,Qui!$A$402)))","v":{"$error":"#NUM!"}},{"$f":"IFERROR((VLOOKUP(CONCATENATE(B37,C37),Qui!$D$301:$F$356,3,)),0)","v":0},33,null,null,0,{"$f":"IFERROR((VLOOKUP(CONCATENATE(P37,Q37),Qui!$D$301:$F$356,3,0)),0)","v":0}]
[34,null,null,null,null,null,null,null,null,null,null,null,{"$f":"SUM(D38:L38*(D38:L38>=LARGE(D38:L38,Qui!$A$402)))","v":{"$error":"#NUM!"}},{"$f":"IFERROR((VLOOKUP(CONCATENATE(B38,C38),Qui!$D$301:$F$356,3,)),0)","v":0},34,null,null,0,{"$f":"IFERROR((VLOOKUP(CONCATENATE(P38,Q38),Qui!$D$301:$F$356,3,0)),0)","v":0}]
[35,null,null,null,null,null,null,null,null,null,null,null,{"$f":"SUM(D39:L39*(D39:L39>=LARGE(D39:L39,Qui!$A$402)))","v":{"$error":"#NUM!"}},{"$f":"IFERROR((VLOOKUP(CONCATENATE(B39,C39),Qui!$D$301:$F$356,3,)),0)","v":0},35,null,null,0,{"$f":"IFERROR((VLOOKUP(CONCATENATE(P39,Q39),Qui!$D$301:$F$356,3,0)),0)","v":0}]
[36,null,null,0,0,0,0,0,0,0,0,0,{"$f":"SUM(D40:L40*(D40:L40>=LARGE(D40:L40,Qui!$A$402)))","v":0},{"$f":"IFERROR((VLOOKUP(CONCATENATE(B40,C40),Qui!$D$301:$F$356,3,)),0)","v":0},36,null,null,0,{"$f":"IFERROR((VLOOKUP(CONCATENATE(P40,Q40),Qui!$D$301:$F$356,3,0)),0)","v":0}]
[37,null,null,0,0,0,0,0,0,0,0,0,{"$f":"SUM(D41:L41*(D41:L41>=LARGE(D41:L41,Qui!$A$402)))","v":0},{"$f":"IFERROR((VLOOKUP(CONCATENATE(B41,C41),Qui!$D$301:$F$356,3,)),0)","v":0},37,null,null,0,{"$f":"IFERROR((VLOOKUP(CONCATENATE(P41,Q41),Qui!$D$301:$F$356,3,0)),0)","v":0}]
[38,null,null,0,0,0,0,0,0,0,0,0,{"$f":"SUM(D42:L42*(D42:L42>=LARGE(D42:L42,Qui!$A$402)))","v":0},{"$f":"IFERROR((VLOOKUP(CONCATENATE(B42,C42),Qui!$D$301:$F$356,3,)),0)","v":0},38,null,null,0,{"$f":"IFERROR((VLOOKUP(CONCATENATE(P42,Q42),Qui!$D$301:$F$356,3,0)),0)","v":0}]
[39,null,null,0,0,0,0,0,0,0,0,0,{"$f":"SUM(D43:L43*(D43:L43>=LARGE(D43:L43,Qui!$A$402)))","v":0},{"$f":"IFERROR((VLOOKUP(CONCATENATE(B43,C43),Qui!$D$301:$F$356,3,)),0)","v":0},39,null,null,0,{"$f":"IFERROR((VLOOKUP(CONCATENATE(P43,Q43),Qui!$D$301:$F$356,3,0)),0)","v":0}]
[40,null,null,0,0,0,0,0,0,0,0,0,{"$f":"SUM(D44:L44*(D44:L44>=LARGE(D44:L44,Qui!$A$402)))","v":0},{"$f":"IFERROR((VLOOKUP(CONCATENATE(B44,C44),Qui!$D$301:$F$356,3,)),0)","v":0},40,null,null,0,{"$f":"IFERROR((VLOOKUP(CONCATENATE(P44,Q44),Qui!$D$301:$F$356,3,0)),0)","v":0}]
[41,null,null,0,0,0,0,0,0,0,0,0,{"$f":"SUM(D45:L45*(D45:L45>=LARGE(D45:L45,Qui!$A$402)))","v":0},{"$f":"IFERROR((VLOOKUP(CONCATENATE(B45,C45),Qui!$D$301:$F$356,3,)),0)","v":0},41,null,null,0,{"$f":"IFERROR((VLOOKUP(CONCATENATE(P45,Q45),Qui!$D$301:$F$356,3,0)),0)","v":0}]
[42,null,null,0,0,0,0,0,0,0,0,0,{"$f":"SUM(D46:L46*(D46:L46>=LARGE(D46:L46,Qui!$A$402)))","v":0},{"$f":"IFERROR((VLOOKUP(CONCATENATE(B46,C46),Qui!$D$301:$F$356,3,)),0)","v":0},42,null,null,0,{"$f":"IFERROR((VLOOKUP(CONCATENATE(P46,Q46),Qui!$D$301:$F$356,3,0)),0)","v":0}]
[43,null,null,0,0,0,0,0,0,0,0,0,{"$f":"SUM(D47:L47*(D47:L47>=LARGE(D47:L47,Qui!$A$402)))","v":0},{"$f":"IFERROR((VLOOKUP(CONCATENATE(B47,C47),Qui!$D$301:$F$356,3,)),0)","v":0},43,null,null,0,{"$f":"IFERROR((VLOOKUP(CONCATENATE(P47,Q47),Qui!$D$301:$F$356,3,0)),0)","v":0}]
[44,null,null,0,0,0,0,0,0,0,0,0,{"$f":"SUM(D48:L48*(D48:L48>=LARGE(D48:L48,Qui!$A$402)))","v":0},{"$f":"IFERROR((VLOOKUP(CONCATENATE(B48,C48),Qui!$D$301:$F$356,3,)),0)","v":0},44,null,null,0,{"$f":"IFERROR((VLOOKUP(CONCATENATE(P48,Q48),Qui!$D$301:$F$356,3,0)),0)","v":0}]
[45,null,null,0,0,0,0,0,0,0,0,0,{"$f":"SUM(D49:L49*(D49:L49>=LARGE(D49:L49,Qui!$A$402)))","v":0},{"$f":"IFERROR((VLOOKUP(CONCATENATE(B49,C49),Qui!$D$301:$F$356,3,)),0)","v":0},45,null,null,0,{"$f":"IFERROR((VLOOKUP(CONCATENATE(P49,Q49),Qui!$D$301:$F$356,3,0)),0)","v":0}]
[46,null,null,0,0,0,0,0,0,0,0,0,{"$f":"SUM(D50:L50*(D50:L50>=LARGE(D50:L50,Qui!$A$402)))","v":0},{"$f":"IFERROR((VLOOKUP(CONCATENATE(B50,C50),Qui!$D$301:$F$356,3,)),0)","v":0},46,null,null,0,{"$f":"IFERROR((VLOOKUP(CONCATENATE(P50,Q50),Qui!$D$301:$F$356,3,0)),0)","v":0}]
[47,null,null,0,0,0,0,0,0,0,0,0,{"$f":"SUM(D51:L51*(D51:L51>=LARGE(D51:L51,Qui!$A$402)))","v":0},{"$f":"IFERROR((VLOOKUP(CONCATENATE(B51,C51),Qui!$D$301:$F$356,3,)),0)","v":0},47,null,null,0,{"$f":"IFERROR((VLOOKUP(CONCATENATE(P51,Q51),Qui!$D$301:$F$356,3,0)),0)","v":0}]
[48,null,null,0,0,0,0,0,0,0,0,0,{"$f":"SUM(D52:L52*(D52:L52>=LARGE(D52:L52,Qui!$A$402)))","v":0},{"$f":"IFERROR((VLOOKUP(CONCATENATE(B52,C52),Qui!$D$301:$F$356,3,)),0)","v":0},48,null,null,0,{"$f":"IFERROR((VLOOKUP(CONCATENATE(P52,Q52),Qui!$D$301:$F$356,3,0)),0)","v":0}]
[49,null,null,0,0,0,0,0,0,0,0,0,{"$f":"SUM(D53:L53*(D53:L53>=LARGE(D53:L53,Qui!$A$402)))","v":0},{"$f":"IFERROR((VLOOKUP(CONCATENATE(B53,C53),Qui!$D$301:$F$356,3,)),0)","v":0},49,null,null,0,{"$f":"IFERROR((VLOOKUP(CONCATENATE(P53,Q53),Qui!$D$301:$F$356,3,0)),0)","v":0}]
[50,null,null,0,0,0,0,0,0,0,0,0,{"$f":"SUM(D54:L54*(D54:L54>=LARGE(D54:L54,Qui!$A$402)))","v":0},{"$f":"IFERROR((VLOOKUP(CONCATENATE(B54,C54),Qui!$D$301:$F$356,3,)),0)","v":0},50,null,null,0,{"$f":"IFERROR((VLOOKUP(CONCATENATE(P54,Q54),Qui!$D$301:$F$356,3,0)),0)","v":0}]
[51,null,null,0,0,0,0,0,0,0,0,0,{"$f":"SUM(D55:L55*(D55:L55>=LARGE(D55:L55,Qui!$A$402)))","v":0},{"$f":"IFERROR((VLOOKUP(CONCATENATE(B55,C55),Qui!$D$301:$F$356,3,)),0)","v":0},51,null,null,0,{"$f":"IFERROR((VLOOKUP(CONCATENATE(P55,Q55),Qui!$D$301:$F$356,3,0)),0)","v":0}]
[52,null,null,0,0,0,0,0,0,0,0,0,{"$f":"SUM(D56:L56*(D56:L56>=LARGE(D56:L56,Qui!$A$402)))","v":0},{"$f":"IFERROR((VLOOKUP(CONCATENATE(B56,C56),Qui!$D$301:$F$356,3,)),0)","v":0},52,null,null,0,{"$f":"IFERROR((VLOOKUP(CONCATENATE(P56,Q56),Qui!$D$301:$F$356,3,0)),0)","v":0}]
[53,null,null,null,0,0,0,0,0,0,0,0,{"$f":"SUM(D57:L57*(D57:L57>=LARGE(D57:L57,Qui!$A$402)))","v":0},{"$f":"IFERROR((VLOOKUP(CONCATENATE(B57,C57),Qui!$D$301:$F$356,3,)),0)","v":0},53,null,null,0,{"$f":"IFERROR((VLOOKUP(CONCATENATE(P57,Q57),Qui!$D$301:$F$356,3,0)),0)","v":0}]
[54,null,null,null,0,0,0,0,0,0,0,0,{"$f":"SUM(D58:L58*(D58:L58>=LARGE(D58:L58,Qui!$A$402)))","v":0},{"$f":"IFERROR((VLOOKUP(CONCATENATE(B58,C58),Qui!$D$301:$F$356,3,)),0)","v":0},54,null,null,0,{"$f":"IFERROR((VLOOKUP(CONCATENATE(P58,Q58),Qui!$D$301:$F$356,3,0)),0)","v":0}]
[null,null,null,{"$f":"MAX(D5:D58)","v":0},null,{"$f":"MAX(F5:F58)","v":0},{"$f":"MAX(G5:G58)","v":0},null,{"$f":"MAX(I5:I58)","v":0},{"$f":"MAX(J5:J58)","v":0},{"$f":"MAX(K5:K58)","v":0},{"$f":"MAX(L5:L58)","v":0}]
["Classement général par équipe",null,null,null,null,null,null,null,null,null,null,null,null,null,"Classement par équipe"]
[]
[1,null,null,null,null,null,null,null,null,null,null,null,{"$f":"SUM(D62:L62*(D62:L62>=LARGE(D62:L62,Qui!$B$402)))","v":{"$error":"#NUM!"}},{"$f":"VLOOKUP(B62,Qui!$A$201:$D$204,4)","v":{"$error":"#N/A"}},1,null,null,0,{"$f":"VLOOKUP(P62,Qui!$A$201:$D$204,4)","v":{"$error":"#N/A"}}]
[2,null,null,null,null,null,null,null,null,null,null,null,{"$f":"SUM(D63:L63*(D63:L63>=LARGE(D63:L63,Qui!$B$402)))","v":{"$error":"#NUM!"}},{"$f":"VLOOKUP(B63,Qui!$A$201:$D$204,4)","v":{"$error":"#N/A"}},2,null,null,0,{"$f":"VLOOKUP(P63,Qui!$A$201:$D$204,4)","v":{"$error":"#N/A"}}]
[3,null,null,null,null,null,null,null,null,null,null,null,{"$f":"SUM(D64:L64*(D64:L64>=LARGE(D64:L64,Qui!$B$402)))","v":{"$error":"#NUM!"}},{"$f":"VLOOKUP(B64,Qui!$A$201:$D$204,4)","v":{"$error":"#N/A"}},3,null,null,0,{"$f":"VLOOKUP(P64,Qui!$A$201:$D$204,4)","v":{"$error":"#N/A"}}]
[4,null,null,null,null,null,null,null,null,null,null,null,{"$f":"SUM(D65:L65*(D65:L65>=LARGE(D65:L65,Qui!$B$402)))","v":{"$error":"#NUM!"}},{"$f":"VLOOKUP(B65,Qui!$A$201:$D$204,4)","v":{"$error":"#N/A"}},4,null,null,0,{"$f":"VLOOKUP(P65,Qui!$A$201:$D$204,4)","v":{"$error":"#N/A"}}]
[5,null,null,null,435,{"$error":"#N/A"},{"$error":"#N/A"},{"$error":"#N/A"},null,null,null,null,{"$f":"SUM(D66:L66*(D66:L66>=LARGE(D66:L66,Qui!$B$402)))","v":{"$error":"#N/A"}},{"$f":"VLOOKUP(B66,Qui!$A$201:$D$204,4)","v":{"$error":"#N/A"}},5,null,null,{"$f":"SUMPRODUCT(((($S$5:$S$58=S66)*$R$5:$R$58*1))*((($S$5:$S$58=S66)*$R$5:$R$58*1)>=LARGE((($S$5:$S$58=S66)*$R$5:$R$58*1),Qui!$B$402)))","v":{"$error":"#N/A"}},{"$f":"VLOOKUP(P66,Qui!$A$201:$D$204,4)","v":{"$error":"#N/A"}}]
[6,null,null,null,435,{"$error":"#N/A"},{"$error":"#N/A"},{"$error":"#N/A"},null,null,null,null,{"$f":"SUM(D67:L67*(D67:L67>=LARGE(D67:L67,Qui!$B$402)))","v":{"$error":"#N/A"}},{"$f":"VLOOKUP(B67,Qui!$A$201:$D$204,4)","v":{"$error":"#N/A"}},6,null,null,{"$f":"SUMPRODUCT(((($S$5:$S$58=S67)*$R$5:$R$58*1))*((($S$5:$S$58=S67)*$R$5:$R$58*1)>=LARGE((($S$5:$S$58=S67)*$R$5:$R$58*1),Qui!$B$402)))","v":{"$error":"#N/A"}},{"$f":"VLOOKUP(P67,Qui!$A$201:$D$204,4)","v":{"$error":"#N/A"}}]
[null,null,null,{"$f":"MAX(D62:D67)","v":0},null,{"$f":"MAX(F62:F67)","v":{"$error":"#N/A"}},{"$f":"MAX(G62:G67)","v":{"$error":"#N/A"}},null,{"$f":"MAX(I62:I67)","v":0},{"$f":"MAX(J62:J67)","v":0},{"$f":"MAX(K62:K67)","v":0},{"$f":"MAX(L62:L67)","v":0},null,null,null,null,null,0]
[null,null,null,null,null,null,null,null,null,null,null,null,"La Chaux-de-Fonds, le 4 décembre 2019, CM / DP"]
[]
[null,{"$f":"CONCATENATE(\"Rappels :\")","v":"Rappels :"}]
[]
[null,{"$f":"CONCATENATE(\"a) le classement général par équipe  est fait sur le cumul des \",Qui!$B$402,\" meilleurs résultats individuels de chaque manche\")","v":"a) le classement général par équipe  est fait sur le cumul des 5 meilleurs résultats individuels de chaque manche"}]
[null,{"$f":"CONCATENATE(\"b) le classement général individuel est fait sur le cumul des \",Qui!$A$402,\" meilleurs résultats individuels\")","v":"b) le classement général individuel est fait sur le cumul des 5 meilleurs résultats individuels"}]

{"sheet":"Manche_7","index":9,"n_rows":74,"n_cols":19,"rows_kept":74,"cut":false,"hidden":true,"merged":[[73,1,73,17],[0,0,0,17],[1,0,1,17],[2,0,2,1],[2,15,2,17],[3,15,3,17],[60,1,60,2],[60,15,60,16],[67,1,67,2],[68,12,68,17],[70,1,70,17],[71,1,71,17],[72,1,72,17]]}
["Association intercantonale \ndes joueurs de boules\nGrand Jeu Neuchâtelois"]
[{"$f":"CONCATENATE(\"Championnat grand jeu neuchâtelois \",YEAR(Calendrier!B6))","v":"Championnat grand jeu neuchâtelois 2020"}]
["Classement général individuel",null,"Manches",{"$f":"Calendrier!F40","v":"Le Locle"},{"$f":"Calendrier!F47","v":"Grand-Sommartel"},{"$f":"Calendrier!F54","v":"L'Epi"},{"$f":"Calendrier!F61","v":"La  Chaux-de-Fonds"},{"$f":"Calendrier!F68","v":"Evologia"},{"$f":"Calendrier!F75","v":"La  Vue-des-Alpes"},{"$f":"Calendrier!F82","v":"00:00:00"},null,null,{"$f":"CONCATENATE(\"Général\",CHAR(10),\"les \",Qui!$A$402,\" meilleurs\")","v":"Général\nles 5 meilleurs"},null,null,{"$f":"CONCATENATE(\"Classement de la manche\",CHAR(10),Calendrier!F82,CHAR(10),\"du \",TEXT(Calendrier!F84,\" jj.mm\"),\" au \",TEXT(Calendrier!F87,\" jj.mm.aaaa\"))","v":"Classement de la manche\n\ndu  07.01 au  10.01.1900"}]
[null,null,null,1,2,3,4,5,6,7,8,9,null,null,null,{"$f":"CONCATENATE(\"Champion de jeu : \",CHAR(10),P5,\" \",Q5)","v":"Champion de jeu : \n "}]
[1,null,null,null,null,null,null,null,null,null,null,null,{"$f":"SUM(D5:L5*(D5:L5>=LARGE(D5:L5,Qui!$A$402)))","v":{"$error":"#NUM!"}},{"$f":"IFERROR((VLOOKUP(CONCATENATE(B5,C5),Qui!$D$301:$F$356,3,)),0)","v":0},1,null,null,0,{"$f":"IFERROR((VLOOKUP(CONCATENATE(P5,Q5),Qui!$D$301:$F$356,3,0)),0)","v":0}]
[2,null,null,null,null,null,null,null,null,null,null,null,{"$f":"SUM(D6:L6*(D6:L6>=LARGE(D6:L6,Qui!$A$402)))","v":{"$error":"#NUM!"}},{"$f":"IFERROR((VLOOKUP(CONCATENATE(B6,C6),Qui!$D$301:$F$356,3,)),0)","v":0},2,null,null,0,{"$f":"IFERROR((VLOOKUP(CONCATENATE(P6,Q6),Qui!$D$301:$F$356,3,0)),0)","v":0}]
[3,null,null,null,null,null,null,null,null,null,null,null,{"$f":"SUM(D7:L7*(D7:L7>=LARGE(D7:L7,Qui!$A$402)))","v":{"$error":"#NUM!"}},{"$f":"IFERROR((VLOOKUP(CONCATENATE(B7,C7),Qui!$D$301:$F$356,3,)),0)","v":0},3,null,null,0,{"$f":"IFERROR((VLOOKUP(CONCATENATE(P7,Q7),Qui!$D$301:$F$356,3,0)),0)","v":0}]
[4,null,null,null,null,null,null,null,null,null,null,null,{"$f":"SUM(D8:L8*(D8:L8>=LARGE(D8:L8,Qui!$A$402)))","v":{"$error":"#NUM!"}},{"$f":"IFERROR((VLOOKUP(CONCATENATE(B8,C8),Qui!$D$301:$F$356,3,)),0)","v":0},4,null,null,0,{"$f":"IFERROR((VLOOKUP(CONCATENATE(P8,Q8),Qui!$D$301:$F$356,3,0)),0)","v":0}]
[5,null,null,null,null,null,null,null,null,null,null,null,{"$f":"SUM(D9:L9*(D9:L9>=LARGE(D9:L9,Qui!$A$402)))","v":{"$error":"#NUM!"}},{"$f":"IFERROR((VLOOKUP(CONCATENATE(B9,C9),Qui!$D$301:$F$356,3,)),0)","v":0},5,null,null,0,{"$f":"IFERROR((VLOOKUP(CONCATENATE(P9,Q9),Qui!$D$301:$F$356,3,0)),0)","v":0}]
[6,null,null,null,null,null,null,null,null,null,null,null,{"$f":"SUM(D10:L10*(D10:L10>=LARGE(D10:L10,Qui!$A$402)))","v":{"$error":"#NUM!"}},{"$f":"IFERROR((VLOOKUP(CONCATENATE(B10,C10),Qui!$D$301:$F$356,3,)),0)","v":0},6,null,null,0,{"$f":"IFERROR((VLOOKUP(CONCATENATE(P10,Q10),Qui!$D$301:$F$356,3,0)),0)","v":0}]
[7,null,null,null,null,null,null,null,null,null,null,null,{"$f":"SUM(D11:L11*(D11:L11>=LARGE(D11:L11,Qui!$A$402)))","v":{"$error":"#NUM!"}},{"$f":"IFERROR((VLOOKUP(CONCATENATE(B11,C11),Qui!$D$301:$F$356,3,)),0)","v":0},7,null,null,0,{"$f":"IFERROR((VLOOKUP(CONCATENATE(P11,Q11),Qui!$D$301:$F$356,3,0)),0)","v":0}]
[8,null,null,null,null,null,null,null,null,null,null,null,{"$f":"SUM(D12:L12*(D12:L12>=LARGE(D12:L12,Qui!$A$402)))","v":{"$error":"#NUM!"}},{"$f":"IFERROR((VLOOKUP(CONCATENATE(B12,C12),Qui!$D$301:$F$356,3,)),0)","v":0},8,null,null,0,{"$f":"IFERROR((VLOOKUP(CONCATENATE(P12,Q12),Qui!$D$301:$F$356,3,0)),0)","v":0}]
[9,null,null,null,null,null,null,null,null,null,null,null,{"$f":"SUM(D13:L13*(D13:L13>=LARGE(D13:L13,Qui!$A$402)))","v":{"$error":"#NUM!"}},{"$f":"IFERROR((VLOOKUP(CONCATENATE(B13,C13),Qui!$D$301:$F$356,3,)),0)","v":0},9,null,null,0,{"$f":"IFERROR((VLOOKUP(CONCATENATE(P13,Q13),Qui!$D$301:$F$356,3,0)),0)","v":0}]
[10,null,null,null,null,null,null,null,null,null,null,null,{"$f":"SUM(D14:L14*(D14:L14>=LARGE(D14:L14,Qui!$A$402)))","v":{"$error":"#NUM!"}},{"$f":"IFERROR((VLOOKUP(CONCATENATE(B14,C14),Qui!$D$301:$F$356,3,)),0)","v":0},10,null,null,0,{"$f":"IFERROR((VLOOKUP(CONCATENATE(P14,Q14),Qui!$D$301:$F$356,3,0)),0)","v":0}]
[11,null,null,null,null,null,null,null,null,null,null,null,{"$f":"SUM(D15:L15*(D15:L15>=LARGE(D15:L15,Qui!$A$402)))","v":{"$error":"#NUM!"}},{"$f":"IFERROR((VLOOKUP(CONCATENATE(B15,C15),Qui!$D$301:$F$356,3,)),0)","v":0},11,null,null,0,{"$f":"IFERROR((VLOOKUP(CONCATENATE(P15,Q15),Qui!$D$301:$F$356,3,0)),0)","v":0}]
[12,null,null,null,null,null,null,null,null,null,null,null,{"$f":"SUM(D16:L16*(D16:L16>=LARGE(D16:L16,Qui!$A$402)))","v":{"$error":"#NUM!"}},{"$f":"IFERROR((VLOOKUP(CONCATENATE(B16,C16),Qui!$D$301:$F$356,3,)),0)","v":0},12,null,null,0,{"$f":"IFERROR((VLOOKUP(CONCATENATE(P16,Q16),Qui!$D$301:$F$356,3,0)),0)","v":0}]
[13,null,null,null,null,null,null,null,null,null,null,null,{"$f":"SUM(D17:L17*(D17:L17>=LARGE(D17:L17,Qui!$A$402)))","v":{"$error":"#NUM!"}},{"$f":"IFERROR((VLOOKUP(CONCATENATE(B17,C17),Qui!$D$301:$F$356,3,)),0)","v":0},13,null,null,0,{"$f":"IFERROR((VLOOKUP(CONCATENATE(P17,Q17),Qui!$D$301:$F$356,3,0)),0)","v":0}]
[14,null,null,null,null,null,null,null,null,null,null,null,{"$f":"SUM(D18:L18*(D18:L18>=LARGE(D18:L18,Qui!$A$402)))","v":{"$error":"#NUM!"}},{"$f":"IFERROR((VLOOKUP(CONCATENATE(B18,C18),Qui!$D$301:$F$356,3,)),0)","v":0},14,null,null,0,{"$f":"IFERROR((VLOOKUP(CONCATENATE(P18,Q18),Qui!$D$301:$F$356,3,0)),0)","v":0}]
[15,null,null,null,null,null,null,null,null,null,null,null,{"$f":"SUM(D19:L19*(D19:L19>=LARGE(D19:L19,Qui!$A$402)))","v":{"$error":"#NUM!"}},{"$f":"IFERROR((VLOOKUP(CONCATENATE(B19,C19),Qui!$D$301:$F$356,3,)),0)","v":0},15,null,null,0,{"$f":"IFERROR((VLOOKUP(CONCATENATE(P19,Q19),Qui!$D$301:$F$356,3,0)),0)","v":0}]
[16,null,null,null,null,null,null,null,null,null,null,null,{"$f":"SUM(D20:L20*(D20:L20>=LARGE(D20:L20,Qui!$A$402)))","v":{"$error":"#NUM!"}},{"$f":"IFERROR((VLOOKUP(CONCATENATE(B20,C20),Qui!$D$301:$F$356,3,)),0)","v":0},16,null,null,0,{"$f":"IFERROR((VLOOKUP(CONCATENATE(P20,Q20),Qui!$D$301:$F$356,3,0)),0)","v":0}]
[17,null,null,null,null,null,null,null,null,null,null,null,{"$f":"SUM(D21:L21*(D21:L21>=LARGE(D21:L21,Qui!$A$402)))","v":{"$error":"#NUM!"}},{"$f":"IFERROR((VLOOKUP(CONCATENATE(B21,C21),Qui!$D$301:$F$356,3,)),0)","v":0},17,null,null,0,{"$f":"IFERROR((VLOOKUP(CONCATENATE(P21,Q21),Qui!$D$301:$F$356,3,0)),0)","v":0}]
[18,null,null,null,null,null,null,null,null,null,null,null,{"$f":"SUM(D22:L22*(D22:L22>=LARGE(D22:L22,Qui!$A$402)))","v":{"$error":"#NUM!"}},{"$f":"IFERROR((VLOOKUP(CONCATENATE(B22,C22),Qui!$D$301:$F$356,3,)),0)","v":0},18,null,null,0,{"$f":"IFERROR((VLOOKUP(CONCATENATE(P22,Q22),Qui!$D$301:$F$356,3,0)),0)","v":0}]
[19,null,null,null,null,null,null,null,null,null,null,null,{"$f":"SUM(D23:L23*(D23:L23>=LARGE(D23:L23,Qui!$A$402)))","v":{"$error":"#NUM!"}},{"$f":"IFERROR((VLOOKUP(CONCATENATE(B23,C23),Qui!$D$301:$F$356,3,)),0)","v":0},19,null,null,0,{"$f":"IFERROR((VLOOKUP(CONCATENATE(P23,Q23),Qui!$D$301:$F$356,3,0)),0)","v":0}]
[20,null,null,null,null,null,null,null,null,null,null,null,{"$f":"SUM(D24:L24*(D24:L24>=LARGE(D24:L24,Qui!$A$402)))","v":{"$error":"#NUM!"}},{"$f":"IFERROR((VLOOKUP(CONCATENATE(B24,C24),Qui!$D$301:$F$356,3,)),0)","v":0},20,null,null,0,{"$f":"IFERROR((VLOOKUP(CONCATENATE(P24,Q24),Qui!$D$301:$F$356,3,0)),0)","v":0}]
[21,null,null,null,null,null,null,null,null,null,null,null,{"$f":"SUM(D25:L25*(D25:L25>=LARGE(D25:L25,Qui!$A$402)))","v":{"$error":"#NUM!"}},{"$f":"IFERROR((VLOOKUP(CONCATENATE(B25,C25),Qui!$D$301:$F$356,3,)),0)","v":0},21,null,null,0,{"$f":"IFERROR((VLOOKUP(CONCATENATE(P25,Q25),Qui!$D$301:$F$356,3,0)),0)","v":0}]
[22,null,null,null,null,null,null,null,null,null,null,null,{"$f":"SUM(D26:L26*(D26:L26>=LARGE(D26:L26,Qui!$A$402)))","v":{"$error":"#NUM!"}},{"$f":"IFERROR((VLOOKUP(CONCATENATE(B26,C26),Qui!$D$301:$F$356,3,)),0)","v":0},22,null,null,0,{"$f":"IFERROR((VLOOKUP(CONCATENATE(P26,Q26),Qui!$D$301:$F$356,3,0)),0)","v":0}]
[23,null,null,null,null,null,null,null,null,null,null,null,{"$f":"SUM(D27:L27*(D27:L27>=LARGE(D27:L27,Qui!$A$402)))","v":{"$error":"#NUM!"}},{"$f":"IFERROR((VLOOKUP(CONCATENATE(B27,C27),Qui!$D$301:$F$356,3,)),0)","v":0},23,null,null,0,{"$f":"IFERROR((VLOOKUP(CONCATENATE(P27,Q27),Qui!$D$301:$F$356,3,0)),0)","v":0}]
[24,null,null,null,null,null,null,null,null,null,null,null,{"$f":"SUM(D28:L28*(D28:L28>=LARGE(D28:L28,Qui!$A$402)))","v":{"$error":"#NUM!"}},{"$f":"IFERROR((VLOOKUP(CONCATENATE(B28,C28),Qui!$D$301:$F$356,3,)),0)","v":0},24,null,null,0,{"$f":"IFERROR((VLOOKUP(CONCATENATE(P28,Q28),Qui!$D$301:$F$356,3,0)),0)","v":0}]
[25,null,null,null,null,null,null,null,null,null,null,null,{"$f":"SUM(D29:L29*(D29:L29>=LARGE(D29:L29,Qui!$A$402)))","v":{"$error":"#NUM!"}},{"$f":"IFERROR((VLOOKUP(CONCATENATE(B29,C29),Qui!$D$301:$F$356,3,)),0)","v":0},25,null,null,0,{"$f":"IFERROR((VLOOKUP(CONCATENATE(P29,Q29),Qui!$D$301:$F$356,3,0)),0)","v":0}]
[26,null,null,null,null,null,null,null,null,null,null,null,{"$f":"SUM(D30:L30*(D30:L30>=LARGE(D30:L30,Qui!$A$402)))","v":{"$error":"#NUM!"}},{"$f":"IFERROR((VLOOKUP(CONCATENATE(B30,C30),Qui!$D$301:$F$356,3,)),0)","v":0},26,null,null,0,{"$f":"IFERROR((VLOOKUP(CONCATENATE(P30,Q30),Qui!$D$301:$F$356,3,0)),0)","v":0}]
[27,null,null,null,null,null,null,null,null,null,null,null,{"$f":"SUM(D31:L31*(D31:L31>=LARGE(D31:L31,Qui!$A$402)))","v":{"$error":"#NUM!"}},{"$f":"IFERROR((VLOOKUP(CONCATENATE(B31,C31),Qui!$D$301:$F$356,3,)),0)","v":0},27,null,null,0,{"$f":"IFERROR((VLOOKUP(CONCATENATE(P31,Q31),Qui!$D$301:$F$356,3,0)),0)","v":0}]
[28,null,null,null,null,null,null,null,null,null,null,null,{"$f":"SUM(D32:L32*(D32:L32>=LARGE(D32:L32,Qui!$A$402)))","v":{"$error":"#NUM!"}},{"$f":"IFERROR((VLOOKUP(CONCATENATE(B32,C32),Qui!$D$301:$F$356,3,)),0)","v":0},28,null,null,0,{"$f":"IFERROR((VLOOKUP(CONCATENATE(P32,Q32),Qui!$D$301:$F$356,3,0)),0)","v":0}]
[29,null,null,null,null,null,null,null,null,null,null,null,{"$f":"SUM(D33:L33*(D33:L33>=LARGE(D33:L33,Qui!$A$402)))","v":{"$error":"#NUM!"}},{"$f":"IFERROR((VLOOKUP(CONCATENATE(B33,C33),Qui!$D$301:$F$356,3,)),0)","v":0},29,null,null,0,{"$f":"IFERROR((VLOOKUP(CONCATENATE(P33,Q33),Qui!$D$301:$F$356,3,0)),0)","v":0}]
[30,null,null,null,null,null,null,null,null,null,null,null,{"$f":"SUM(D34:L34*(D34:L34>=LARGE(D34:L34,Qui!$A$402)))","v":{"$error":"#NUM!"}},{"$f":"IFERROR((VLOOKUP(CONCATENATE(B34,C34),Qui!$D$301:$F$356,3,)),0)","v":0},30,null,null,0,{"$f":"IFERROR((VLOOKUP(CONCATENATE(P34,Q34),Qui!$D$301:$F$356,3,0)),0)","v":0}]
[31,null,null,null,null,null,null,null,null,null,null,null,{"$f":"SUM(D35:L35*(D35:L35>=LARGE(D35:L35,Qui!$A$402)))","v":{"$error":"#NUM!"}},{"$f":"IFERROR((VLOOKUP(CONCATENATE(B35,C35),Qui!$D$301:$F$356,3,)),0)","v":0},31,null,null,0,{"$f":"IFERROR((VLOOKUP(CONCATENATE(P35,Q35),Qui!$D$301:$F$356,3,0)),0)","v":0}]
[32,null,null,null,null,null,null,null,null,null,null,null,{"$f":"SUM(D36:L36*(D36:L36>=LARGE(D36:L36,Qui!$A$402)))","v":{"$error":"#NUM!"}},{"$f":"IFERROR((VLOOKUP(CONCATENATE(B36,C36),Qui!$D$301:$F$356,3,)),0)","v":0},32,null,null,0,{"$f":"IFERROR((VLOOKUP(CONCATENATE(P36,Q36),Qui!$D$301:$F$356,3,0)),0)","v":0}]
[33,null,null,null,null,null,null,null,null,null,null,null,{"$f":"SUM(D37:L37*(D37:L37>=LARGE(D37:L37,Qui!$A$402)))","v":{"$error":"#NUM!"}},{"$f":"IFERROR((VLOOKUP(CONCATENATE(B37,C37),Qui!$D$301:$F$356,3,)),0)","v":0},33,null,null,0,{"$f":"IFERROR((VLOOKUP(CONCATENATE(P37,Q37),Qui!$D$301:$F$356,3,0)),0)","v":0}]
[34,null,null,null,null,null,null,null,null,null,null,null,{"$f":"SUM(D38:L38*(D38:L38>=LARGE(D38:L38,Qui!$A$402)))","v":{"$error":"#NUM!"}},{"$f":"IFERROR((VLOOKUP(CONCATENATE(B38,C38),Qui!$D$301:$F$356,3,)),0)","v":0},34,null,null,0,{"$f":"IFERROR((VLOOKUP(CONCATENATE(P38,Q38),Qui!$D$301:$F$356,3,0)),0)","v":0}]
[35,null,null,null,null,null,null,null,null,null,null,null,{"$f":"SUM(D39:L39*(D39:L39>=LARGE(D39:L39,Qui!$A$402)))","v":{"$error":"#NUM!"}},{"$f":"IFERROR((VLOOKUP(CONCATENATE(B39,C39),Qui!$D$301:$F$356,3,)),0)","v":0},35,null,null,0,{"$f":"IFERROR((VLOOKUP(CONCATENATE(P39,Q39),Qui!$D$301:$F$356,3,0)),0)","v":0}]
[36,null,null,0,0,0,0,0,0,0,0,0,{"$f":"SUM(D40:L40*(D40:L40>=LARGE(D40:L40,Qui!$A$402)))","v":0},{"$f":"IFERROR((VLOOKUP(CONCATENATE(B40,C40),Qui!$D$301:$F$356,3,)),0)","v":0},36,null,null,0,{"$f":"IFERROR((VLOOKUP(CONCATENATE(P40,Q40),Qui!$D$301:$F$356,3,0)),0)","v":0}]
[37,null,null,0,0,0,0,0,0,0,0,0,{"$f":"SUM(D41:L41*(D41:L41>=LARGE(D41:L41,Qui!$A$402)))","v":0},{"$f":"IFERROR((VLOOKUP(CONCATENATE(B41,C41),Qui!$D$301:$F$356,3,)),0)","v":0},37,null,null,0,{"$f":"IFERROR((VLOOKUP(CONCATENATE(P41,Q41),Qui!$D$301:$F$356,3,0)),0)","v":0}]
[38,null,null,0,0,0,0,0,0,0,0,0,{"$f":"SUM(D42:L42*(D42:L42>=LARGE(D42:L42,Qui!$A$402)))","v":0},{"$f":"IFERROR((VLOOKUP(CONCATENATE(B42,C42),Qui!$D$301:$F$356,3,)),0)","v":0},38,null,null,0,{"$f":"IFERROR((VLOOKUP(CONCATENATE(P42,Q42),Qui!$D$301:$F$356,3,0)),0)","v":0}]
[39,null,null,0,0,0,0,0,0,0,0,0,{"$f":"SUM(D43:L43*(D43:L43>=LARGE(D43:L43,Qui!$A$402)))","v":0},{"$f":"IFERROR((VLOOKUP(CONCATENATE(B43,C43),Qui!$D$301:$F$356,3,)),0)","v":0},39,null,null,0,{"$f":"IFERROR((VLOOKUP(CONCATENATE(P43,Q43),Qui!$D$301:$F$356,3,0)),0)","v":0}]
[40,null,null,0,0,0,0,0,0,0,0,0,{"$f":"SUM(D44:L44*(D44:L44>=LARGE(D44:L44,Qui!$A$402)))","v":0},{"$f":"IFERROR((VLOOKUP(CONCATENATE(B44,C44),Qui!$D$301:$F$356,3,)),0)","v":0},40,null,null,0,{"$f":"IFERROR((VLOOKUP(CONCATENATE(P44,Q44),Qui!$D$301:$F$356,3,0)),0)","v":0}]
[41,null,null,0,0,0,0,0,0,0,0,0,{"$f":"SUM(D45:L45*(D45:L45>=LARGE(D45:L45,Qui!$A$402)))","v":0},{"$f":"IFERROR((VLOOKUP(CONCATENATE(B45,C45),Qui!$D$301:$F$356,3,)),0)","v":0},41,null,null,0,{"$f":"IFERROR((VLOOKUP(CONCATENATE(P45,Q45),Qui!$D$301:$F$356,3,0)),0)","v":0}]
[42,null,null,0,0,0,0,0,0,0,0,0,{"$f":"SUM(D46:L46*(D46:L46>=LARGE(D46:L46,Qui!$A$402)))","v":0},{"$f":"IFERROR((VLOOKUP(CONCATENATE(B46,C46),Qui!$D$301:$F$356,3,)),0)","v":0},42,null,null,0,{"$f":"IFERROR((VLOOKUP(CONCATENATE(P46,Q46),Qui!$D$301:$F$356,3,0)),0)","v":0}]
[43,null,null,0,0,0,0,0,0,0,0,0,{"$f":"SUM(D47:L47*(D47:L47>=LARGE(D47:L47,Qui!$A$402)))","v":0},{"$f":"IFERROR((VLOOKUP(CONCATENATE(B47,C47),Qui!$D$301:$F$356,3,)),0)","v":0},43,null,null,0,{"$f":"IFERROR((VLOOKUP(CONCATENATE(P47,Q47),Qui!$D$301:$F$356,3,0)),0)","v":0}]
[44,null,null,0,0,0,0,0,0,0,0,0,{"$f":"SUM(D48:L48*(D48:L48>=LARGE(D48:L48,Qui!$A$402)))","v":0},{"$f":"IFERROR((VLOOKUP(CONCATENATE(B48,C48),Qui!$D$301:$F$356,3,)),0)","v":0},44,null,null,0,{"$f":"IFERROR((VLOOKUP(CONCATENATE(P48,Q48),Qui!$D$301:$F$356,3,0)),0)","v":0}]
[45,null,null,0,0,0,0,0,0,0,0,0,{"$f":"SUM(D49:L49*(D49:L49>=LARGE(D49:L49,Qui!$A$402)))","v":0},{"$f":"IFERROR((VLOOKUP(CONCATENATE(B49,C49),Qui!$D$301:$F$356,3,)),0)","v":0},45,null,null,0,{"$f":"IFERROR((VLOOKUP(CONCATENATE(P49,Q49),Qui!$D$301:$F$356,3,0)),0)","v":0}]
[46,null,null,0,0,0,0,0,0,0,0,0,{"$f":"SUM(D50:L50*(D50:L50>=LARGE(D50:L50,Qui!$A$402)))","v":0},{"$f":"IFERROR((VLOOKUP(CONCATENATE(B50,C50),Qui!$D$301:$F$356,3,)),0)","v":0},46,null,null,0,{"$f":"IFERROR((VLOOKUP(CONCATENATE(P50,Q50),Qui!$D$301:$F$356,3,0)),0)","v":0}]
[47,null,null,0,0,0,0,0,0,0,0,0,{"$f":"SUM(D51:L51*(D51:L51>=LARGE(D51:L51,Qui!$A$402)))","v":0},{"$f":"IFERROR((VLOOKUP(CONCATENATE(B51,C51),Qui!$D$301:$F$356,3,)),0)","v":0},47,null,null,0,{"$f":"IFERROR((VLOOKUP(CONCATENATE(P51,Q51),Qui!$D$301:$F$356,3,0)),0)","v":0}]
[48,null,null,0,0,0,0,0,0,0,0,0,{"$f":"SUM(D52:L52*(D52:L52>=LARGE(D52:L52,Qui!$A$402)))","v":0},{"$f":"IFERROR((VLOOKUP(CONCATENATE(B52,C52),Qui!$D$301:$F$356,3,)),0)","v":0},48,null,null,0,{"$f":"IFERROR((VLOOKUP(CONCATENATE(P52,Q52),Qui!$D$301:$F$356,3,0)),0)","v":0}]
[49,null,null,0,0,0,0,0,0,0,0,0,{"$f":"SUM(D53:L53*(D53:L53>=LARGE(D53:L53,Qui!$A$402)))","v":0},{"$f":"IFERROR((VLOOKUP(CONCATENATE(B53,C53),Qui!$D$301:$F$356,3,)),0)","v":0},49,null,null,0,{"$f":"IFERROR((VLOOKUP(CONCATENATE(P53,Q53),Qui!$D$301:$F$356,3,0)),0)","v":0}]
[50,null,null,0,0,0,0,0,0,0,0,0,{"$f":"SUM(D54:L54*(D54:L54>=LARGE(D54:L54,Qui!$A$402)))","v":0},{"$f":"IFERROR((VLOOKUP(CONCATENATE(B54,C54),Qui!$D$301:$F$356,3,)),0)","v":0},50,null,null,0,{"$f":"IFERROR((VLOOKUP(CONCATENATE(P54,Q54),Qui!$D$301:$F$356,3,0)),0)","v":0}]
[51,null,null,0,0,0,0,0,0,0,0,0,{"$f":"SUM(D55:L55*(D55:L55>=LARGE(D55:L55,Qui!$A$402)))","v":0},{"$f":"IFERROR((VLOOKUP(CONCATENATE(B55,C55),Qui!$D$301:$F$356,3,)),0)","v":0},51,null,null,0,{"$f":"IFERROR((VLOOKUP(CONCATENATE(P55,Q55),Qui!$D$301:$F$356,3,0)),0)","v":0}]
[52,null,null,0,0,0,0,0,0,0,0,0,{"$f":"SUM(D56:L56*(D56:L56>=LARGE(D56:L56,Qui!$A$402)))","v":0},{"$f":"IFERROR((VLOOKUP(CONCATENATE(B56,C56),Qui!$D$301:$F$356,3,)),0)","v":0},52,null,null,0,{"$f":"IFERROR((VLOOKUP(CONCATENATE(P56,Q56),Qui!$D$301:$F$356,3,0)),0)","v":0}]
[53,null,null,null,0,0,0,0,0,0,0,0,{"$f":"SUM(D57:L57*(D57:L57>=LARGE(D57:L57,Qui!$A$402)))","v":0},{"$f":"IFERROR((VLOOKUP(CONCATENATE(B57,C57),Qui!$D$301:$F$356,3,)),0)","v":0},53,null,null,0,{"$f":"IFERROR((VLOOKUP(CONCATENATE(P57,Q57),Qui!$D$301:$F$356,3,0)),0)","v":0}]
[54,null,null,null,0,0,0,0,0,0,0,0,{"$f":"SUM(D58:L58*(D58:L58>=LARGE(D58:L58,Qui!$A$402)))","v":0},{"$f":"IFERROR((VLOOKUP(CONCATENATE(B58,C58),Qui!$D$301:$F$356,3,)),0)","v":0},54,null,null,0,{"$f":"IFERROR((VLOOKUP(CONCATENATE(P58,Q58),Qui!$D$301:$F$356,3,0)),0)","v":0}]
[null,null,null,{"$f":"MAX(D5:D58)","v":0},null,{"$f":"MAX(F5:F58)","v":0},{"$f":"MAX(G5:G58)","v":0},null,{"$f":"MAX(I5:I58)","v":0},{"$f":"MAX(J5:J58)","v":0},{"$f":"MAX(K5:K58)","v":0},{"$f":"MAX(L5:L58)","v":0}]
["Classement général par équipe",null,null,null,null,null,null,null,null,null,null,null,null,null,"Classement par équipe"]
[]
[1,null,null,null,null,null,null,null,null,418.04,null,null,{"$f":"SUM(D62:L62*(D62:L62>=LARGE(D62:L62,Qui!$B$402)))","v":{"$error":"#NUM!"}},{"$f":"VLOOKUP(B62,Qui!$A$201:$D$204,4)","v":{"$error":"#N/A"}},1,null,null,0,{"$f":"VLOOKUP(P62,Qui!$A$201:$D$204,4)","v":{"$error":"#N/A"}}]
[2,null,null,null,null,null,null,null,null,444.03,null,null,{"$f":"SUM(D63:L63*(D63:L63>=LARGE(D63:L63,Qui!$B$402)))","v":{"$error":"#NUM!"}},{"$f":"VLOOKUP(B63,Qui!$A$201:$D$204,4)","v":{"$error":"#N/A"}},2,null,null,0,{"$f":"VLOOKUP(P63,Qui!$A$201:$D$204,4)","v":{"$error":"#N/A"}}]
[3,null,null,null,null,null,null,null,null,412,null,null,{"$f":"SUM(D64:L64*(D64:L64>=LARGE(D64:L64,Qui!$B$402)))","v":{"$error":"#NUM!"}},{"$f":"VLOOKUP(B64,Qui!$A$201:$D$204,4)","v":{"$error":"#N/A"}},3,null,null,0,{"$f":"VLOOKUP(P64,Qui!$A$201:$D$204,4)","v":{"$error":"#N/A"}}]
[4,null,null,null,null,null,null,null,null,426.11,null,null,{"$f":"SUM(D65:L65*(D65:L65>=LARGE(D65:L65,Qui!$B$402)))","v":{"$error":"#NUM!"}},{"$f":"VLOOKUP(B65,Qui!$A$201:$D$204,4)","v":{"$error":"#N/A"}},4,null,null,0,{"$f":"VLOOKUP(P65,Qui!$A$201:$D$204,4)","v":{"$error":"#N/A"}}]
[5,null,null,null,435,{"$error":"#N/A"},{"$error":"#N/A"},{"$error":"#N/A"},null,{"$error":"#N/A"},null,null,{"$f":"SUM(D66:L66*(D66:L66>=LARGE(D66:L66,Qui!$B$402)))","v":{"$error":"#N/A"}},{"$f":"VLOOKUP(B66,Qui!$A$201:$D$204,4)","v":{"$error":"#N/A"}},5,null,null,{"$f":"SUMPRODUCT(((($S$5:$S$58=S66)*$R$5:$R$58*1))*((($S$5:$S$58=S66)*$R$5:$R$58*1)>=LARGE((($S$5:$S$58=S66)*$R$5:$R$58*1),Qui!$B$402)))","v":{"$error":"#N/A"}},{"$f":"VLOOKUP(P66,Qui!$A$201:$D$204,4)","v":{"$error":"#N/A"}}]
[6,null,null,null,435,{"$error":"#N/A"},{"$error":"#N/A"},{"$error":"#N/A"},null,{"$error":"#N/A"},null,null,{"$f":"SUM(D67:L67*(D67:L67>=LARGE(D67:L67,Qui!$B$402)))","v":{"$error":"#N/A"}},{"$f":"VLOOKUP(B67,Qui!$A$201:$D$204,4)","v":{"$error":"#N/A"}},6,null,null,{"$f":"SUMPRODUCT(((($S$5:$S$58=S67)*$R$5:$R$58*1))*((($S$5:$S$58=S67)*$R$5:$R$58*1)>=LARGE((($S$5:$S$58=S67)*$R$5:$R$58*1),Qui!$B$402)))","v":{"$error":"#N/A"}},{"$f":"VLOOKUP(P67,Qui!$A$201:$D$204,4)","v":{"$error":"#N/A"}}]
[null,null,null,{"$f":"MAX(D62:D67)","v":0},null,{"$f":"MAX(F62:F67)","v":{"$error":"#N/A"}},{"$f":"MAX(G62:G67)","v":{"$error":"#N/A"}},null,{"$f":"MAX(I62:I67)","v":0},{"$f":"MAX(J62:J67)","v":{"$error":"#N/A"}},{"$f":"MAX(K62:K67)","v":0},{"$f":"MAX(L62:L67)","v":0},null,null,null,null,null,0]
[null,null,null,null,null,null,null,null,null,null,null,null,"La Chaux-de-Fonds, le 4 décembre 2019, CM / DP"]
[]
[null,{"$f":"CONCATENATE(\"Rappels :\")","v":"Rappels :"}]
[]
[null,{"$f":"CONCATENATE(\"a) le classement général par équipe  est fait sur le cumul des \",Qui!$B$402,\" meilleurs résultats individuels de chaque manche\")","v":"a) le classement général par équipe  est fait sur le cumul des 5 meilleurs résultats individuels de chaque manche"}]
[null,{"$f":"CONCATENATE(\"b) le classement général individuel est fait sur le cumul des \",Qui!$A$402,\" meilleurs résultats individuels\")","v":"b) le classement général individuel est fait sur le cumul des 5 meilleurs résultats individuels"}]

{"sheet":"Challenge_1","index":10,"n_rows":59,"n_cols":27,"rows_kept":59,"cut":false,"hidden":true,"merged":[[3,21,3,26],[56,7,56,8],[0,0,0,9],[1,0,1,9],[3,16,3,18]]}
["Association intercantonale\n des joueurs de boules,\nGrand Jeu Neuchâtelois\n"]
[{"$f":"CONCATENATE(Calendrier!A4,\"      Jeu : \",(Calendrier!F4))","v":"Challenge HIVER      Jeu : Evologia"}]
[null,null,null,null,null,null,null,null,null,{"$f":"CONCATENATE(\"du \",TEXT(Calendrier!F6,\" jj.mm\"),\" au \",TEXT(Calendrier!F9,\" jj.mm.aaaa\"))","v":"du  09.03 au  12.03.2020"}]
["Classement par équipes",null,null,null,null,null,null,"Classement individuel",null,null,null,null,"Equipe",null,null,null,"Equipes possibles",null,null,null,null,"Equipes triées"]
[null,null,null,null,null,null,null,null,null,null,null,null,null,null,null,null,"N°","Nom","Total équipe",null,null,"Rang","Nom","Prénom","Résultat","TotEquipe","Equipe"]
["1er",{"$f":"IF($D11,(INDEX($Q$6:$S$20,MATCH($AA6,$Q$6:$Q$20,0),2)),0)","v":"Le Locle I"},null,null,{"$f":"VLOOKUP(B6,Qui!$A$201:$D$204,4)","v":3},1,null,"Gerber","Michel",111,{"$f":"IFERROR((VLOOKUP(CONCATENATE(H6,I6),Qui!$D$301:$F$356,3,0)),0)","v":3},null,"L1",null,null,null,"C1","La Chaux-de-Fonds  I",{"$f":"SUMIF($M$6:$M$40,\"=\"&$Q6,$J$6:$J$40)","v":300},null,null,1,"Gerber","Michel",111,{"$f":"IF($AA6<>\"\",(IF($Y6,(INDEX($Q$6:$S$20,MATCH($AA6,$Q$6:$Q$20,0),3)),0)),0)","v":400},"L1"]
[null,{"$f":"W6","v":"Gerber"},{"$f":"X6","v":"Michel"},111,null,2,null,"Tynowski","Lucien",103,{"$f":"IFERROR((VLOOKUP(CONCATENATE(H7,I7),Qui!$D$301:$F$356,3,0)),0)","v":3},null,"L1",null,null,null,"C2","La Chaux-de-Fonds  II",134,null,null,2,"Tynowski","Lucien",103,400,"L1"]
[null,{"$f":"W7","v":"Tynowski"},{"$f":"X7","v":"Lucien"},{"$f":"Y7","v":103},null,3,null,"Bühler","Raymond",98,{"$f":"IFERROR((VLOOKUP(CONCATENATE(H8,I8),Qui!$D$301:$F$356,3,0)),0)","v":4},null,"E1",null,null,null,"E1","L'Epi I",361,null,null,3,"Cassi","Alain",96,400,"L1"]
[null,{"$f":"W8","v":"Cassi"},{"$f":"X8","v":"Alain"},{"$f":"Y8","v":96},null,4,null,"Cassi","Alain",96,{"$f":"IFERROR((VLOOKUP(CONCATENATE(H9,I9),Qui!$D$301:$F$356,3,0)),0)","v":3},null,"L1",null,null,null,"E2","L'Epi II",192,null,null,4,"Bart","Fabien",90,400,"L1"]
[null,"Bart","Fabien",90,null,5,null,"Dick","Pierre-Alain",95,{"$f":"IFERROR((VLOOKUP(CONCATENATE(H10,I10),Qui!$D$301:$F$356,3,0)),0)","v":2},null,"V1",null,null,null,"L1","Le Locle I",400,null,null,5,"Bühler","Raymond",98,361,"E1"]
[null,null,"Total",{"$f":"SUM(D7:D10)","v":400},null,6,null,"Mores","Blaise",94,{"$f":"IFERROR((VLOOKUP(CONCATENATE(H11,I11),Qui!$D$301:$F$356,3,0)),0)","v":4},null,"E1",null,null,null,"L2","Le Locle II",0,null,null,6,"Mores","Blaise",94,361,"E1"]
[null,null,null,null,null,7,null,"Wäfler","Jean-Louis",92,{"$f":"IFERROR((VLOOKUP(CONCATENATE(H12,I12),Qui!$D$301:$F$356,3,0)),0)","v":4},null,"E1",null,null,null,"V1","La Vue-des-Alpes I",286.10000000000002,null,null,7,"Wäfler","Jean-Louis",92,361,"E1"]
["2ème",{"$f":"IF($D18,(INDEX($Q$6:$S$20,MATCH($AA10,$Q$6:$Q$20,0),2)),0)","v":"L'Epi I"},null,null,{"$f":"VLOOKUP(B13,Qui!$A$201:$D$204,4)","v":4},8,null,"Bart","Fabien",90,{"$f":"IFERROR((VLOOKUP(CONCATENATE(H13,I13),Qui!$D$301:$F$356,3,0)),0)","v":3},null,"L1",null,null,null,"V2","La Vue-des-Alpes II",0,null,null,8,"Reichen","Sylvain",77,361,"E1"]
[null,{"$f":"W10","v":"Bühler"},{"$f":"X10","v":"Raymond"},98,null,9,null,"Jeanneret","Louis",82,{"$f":"IFERROR((VLOOKUP(CONCATENATE(H14,I14),Qui!$D$301:$F$356,3,0)),0)","v":2},null,"V1",null,null,null,null,null,201,null,null,9,"Billod-Morel","Gérald",82,300,"C1"]
[null,{"$f":"W11","v":"Mores"},{"$f":"X11","v":"Blaise"},{"$f":"Y11","v":94},null,10,null,"Billod-Morel","Gérald",82,{"$f":"IFERROR((VLOOKUP(CONCATENATE(H15,I15),Qui!$D$301:$F$356,3,0)),0)","v":1},null,"C1",null,null,null,null,null,201,null,null,10,"Voirol","Pierre",81,300,"C1"]
[null,"Wäfler","Jean-Louis",92,null,11,null,"Voirol","Pierre",81,{"$f":"IFERROR((VLOOKUP(CONCATENATE(H16,I16),Qui!$D$301:$F$356,3,0)),0)","v":1},null,"C1",null,null,null,null,null,201,null,null,11,"Rollat","Christian",76,300,"C1"]
[null,"Reichen","Sylvain",77,null,12,null,"Pellaton","Daniel",80,{"$f":"IFERROR((VLOOKUP(CONCATENATE(H17,I17),Qui!$D$301:$F$356,3,0)),0)","v":4},null,"E2",null,null,null,null,null,201,null,null,12,"Monnier","Christian",61,300,"C1"]
[null,null,"Total",{"$f":"SUM(D14:D17)","v":361},null,13,null,"Reichen","Sylvain",77,{"$f":"IFERROR((VLOOKUP(CONCATENATE(H18,I18),Qui!$D$301:$F$356,3,0)),0)","v":4},null,"E1",null,null,null,null,null,201,null,null,13,"Dick","Pierre-Alain",95,286.10000000000002,"V1"]
[null,null,null,null,null,14,null,"Rollat","Christian",76,{"$f":"IFERROR((VLOOKUP(CONCATENATE(H19,I19),Qui!$D$301:$F$356,3,0)),0)","v":1},null,"C1",null,null,null,null,null,201,null,null,14,"Jeanneret","Louis",82,286.10000000000002,"V1"]
["3ème",{"$f":"IF($D25,(INDEX($Q$6:$S$20,MATCH($AA14,$Q$6:$Q$20,0),2)),0)","v":"La Chaux-de-Fonds  I"},null,null,{"$f":"VLOOKUP(B20,Qui!$A$201:$D$204,4)","v":1},15,null,"Chassot","Yves",76,{"$f":"IFERROR((VLOOKUP(CONCATENATE(H20,I20),Qui!$D$301:$F$356,3,0)),0)","v":2},null,"V1",null,null,null,null,null,201,null,null,15,"Chassot","Yves",76,286.10000000000002,"V1"]
[null,{"$f":"W14","v":"Billod-Morel"},{"$f":"X14","v":"Gérald"},82,null,16,null,"Rossier","Yves-Alain",69,{"$f":"IFERROR((VLOOKUP(CONCATENATE(H21,I21),Qui!$D$301:$F$356,3,0)),0)","v":4},null,"E2",null,null,null,null,null,null,null,null,16,"Vuillème","Claude-Alain",33.1,286.10000000000002,"V1"]
[null,{"$f":"W15","v":"Voirol"},{"$f":"X15","v":"Pierre"},{"$f":"Y15","v":81},null,17,null,"Monnier","Christian",61,{"$f":"IFERROR((VLOOKUP(CONCATENATE(H22,I22),Qui!$D$301:$F$356,3,0)),0)","v":1},null,"C1",null,null,null,null,null,null,null,null,17,"Pellaton","Daniel",80,192,"E2"]
[null,"Rollat","Christian",76,null,18,null,"Dubois","Eric",59,{"$f":"IFERROR((VLOOKUP(CONCATENATE(H23,I23),Qui!$D$301:$F$356,3,0)),0)","v":1},null,"C2",null,null,null,null,null,null,null,null,18,"Rossier","Yves-Alain",69,192,"E2"]
[null,"Monnier","Christian",61,null,19,null,"Tinguely","Didier",58,{"$f":"IFERROR((VLOOKUP(CONCATENATE(H24,I24),Qui!$D$301:$F$356,3,0)),0)","v":1},null,null,null,null,null,null,null,null,null,null,19,"Frutiger","Bertrand",33,192,"E2"]
[null,null,null,{"$f":"SUM(D21:D24)","v":300},null,20,null,"Oppliger","Hervé",55,{"$f":"IFERROR((VLOOKUP(CONCATENATE(H25,I25),Qui!$D$301:$F$356,3,0)),0)","v":2},null,null,null,null,null,null,null,null,null,null,20,"Rindlisbacher","Heinz",10,192,"E2"]
[null,null,null,null,null,21,null,"Dubois","Marcel",46,{"$f":"IFERROR((VLOOKUP(CONCATENATE(H26,I26),Qui!$D$301:$F$356,3,0)),0)","v":1},null,null,null,null,null,null,null,null,null,null,21,"Dubois","Eric",59,134,"C2"]
["4ème",{"$f":"IF($D32,(INDEX($Q$6:$S$20,MATCH($AA18,$Q$6:$Q$20,0),2)),0)","v":"La Vue-des-Alpes I"},null,null,{"$f":"VLOOKUP(B27,Qui!$A$201:$D$204,4)","v":2},22,null,"Haussener","Philippe",42,{"$f":"IFERROR((VLOOKUP(CONCATENATE(H27,I27),Qui!$D$301:$F$356,3,0)),0)","v":2},null,null,null,null,null,null,null,null,null,null,22,"Dubois","Emmanuel",38,134,"C2"]
[null,{"$f":"W18","v":"Dick"},{"$f":"X18","v":"Pierre-Alain"},95,null,23,null,"Dubois","Emmanuel",38,{"$f":"IFERROR((VLOOKUP(CONCATENATE(H28,I28),Qui!$D$301:$F$356,3,0)),0)","v":1},null,"C2",null,null,null,null,null,null,null,null,23,"Matthey","Pierre",24,134,"C2"]
[null,{"$f":"W19","v":"Jeanneret"},{"$f":"X19","v":"Louis"},{"$f":"Y19","v":82},null,24,null,"Vuillème","Claude-Alain",33.1,{"$f":"IFERROR((VLOOKUP(CONCATENATE(H29,I29),Qui!$D$301:$F$356,3,0)),0)","v":2},null,"V1",null,null,null,null,null,null,null,null,24,"Jean-Mairet","Jean-Claude",13,134,"C2"]
[null,"Chassot","Yves",76,null,25,null,"Frutiger","Bertrand",33,{"$f":"IFERROR((VLOOKUP(CONCATENATE(H30,I30),Qui!$D$301:$F$356,3,0)),0)","v":4},null,"E2",null,null,null,null,null,null,null,null,25,"Tinguely","Didier",58,0]
[null,"Vuillème","Claude-Alain",33.1,null,26,null,"Matthey","Pierre",24,{"$f":"IFERROR((VLOOKUP(CONCATENATE(H31,I31),Qui!$D$301:$F$356,3,0)),0)","v":1},null,"C2",null,null,null,null,null,null,null,null,26,"Oppliger","Hervé",55,0]
[null,null,"Total",{"$f":"SUM(D28:D31)","v":286.10000000000002},null,27,null,"Jean-Mairet","Jean-Claude",13,{"$f":"IFERROR((VLOOKUP(CONCATENATE(H32,I32),Qui!$D$301:$F$356,3,0)),0)","v":1},null,"C2",null,null,null,null,null,null,null,null,27,"Dubois","Marcel",46,0]
[null,null,null,null,null,28,null,"Rindlisbacher","Heinz",10,{"$f":"IFERROR((VLOOKUP(CONCATENATE(H33,I33),Qui!$D$301:$F$356,3,0)),0)","v":4},null,"E2",null,null,null,null,null,null,null,null,28,"Haussener","Philippe",42,0]
["5ème",{"$f":"IF($D39,(INDEX($Q$6:$S$20,MATCH($AA22,$Q$6:$Q$20,0),2)),0)","v":"L'Epi II"},null,null,{"$f":"VLOOKUP(B34,Qui!$A$201:$D$204,4)","v":4},29,null,"Favre","Daniel",0,{"$f":"IFERROR((VLOOKUP(CONCATENATE(H34,I34),Qui!$D$301:$F$356,3,0)),0)","v":3},null,null,null,null,null,null,null,null,null,null,29,"Favre","Daniel",0,0]
[null,{"$f":"W22","v":"Pellaton"},{"$f":"X22","v":"Daniel"},80,null,30,null,"Bourquin","Willy",0,{"$f":"IFERROR((VLOOKUP(CONCATENATE(H35,I35),Qui!$D$301:$F$356,3,0)),0)","v":4},null,null,null,null,null,null,null,null,null,null,30,"Bourquin","Willy",0,0]
[null,{"$f":"W23","v":"Rossier"},{"$f":"X23","v":"Yves-Alain"},{"$f":"Y23","v":69},null,31,null,"Charlet","Léon",0,{"$f":"IFERROR((VLOOKUP(CONCATENATE(H36,I36),Qui!$D$301:$F$356,3,0)),0)","v":2},null,null,null,null,null,null,null,null,null,null,31,"Charlet","Léon",0,0]
[null,"Frutiger","Bertrand",33,null,32,null,"Kemajl","Fetahi",0,{"$f":"IFERROR((VLOOKUP(CONCATENATE(H37,I37),Qui!$D$301:$F$356,3,0)),0)","v":3},null,null,null,null,null,null,null,null,null,null,32,"Kemajl","Fetahi",0,0]
[null,"Rindlisbacher","Heinz",10,null,33,null,"Geiser","Willy",0,{"$f":"IFERROR((VLOOKUP(CONCATENATE(H38,I38),Qui!$D$301:$F$356,3,0)),0)","v":1},null,null,null,null,null,null,null,null,null,null,33,"Geiser","Willy",0,{"$f":"IF($AA38<>\"\",(IF($Y38,(INDEX($Q$6:$S$20,MATCH($AA38,$Q$6:$Q$20,0),3)),0)),0)","v":0}]
[null,null,"Total",{"$f":"SUM(D35:D38)","v":192},null,34,null,null,null,null,{"$f":"IFERROR((VLOOKUP(CONCATENATE(H39,I39),Qui!$D$301:$F$356,3,0)),0)","v":0},null,null,null,null,null,null,null,null,null,null,34,null,null,null,0]
[null,null,null,null,null,35,null,null,null,null,{"$f":"IFERROR((VLOOKUP(CONCATENATE(H40,I40),Qui!$D$301:$F$356,3,0)),0)","v":0},null,null,null,null,null,null,null,null,null,null,35,null,null,null,0]
["6ème",{"$f":"IF($D46,(INDEX($Q$6:$S$20,MATCH($AA26,$Q$6:$Q$20,0),2)),0)","v":"La Chaux-de-Fonds  II"},null,null,{"$f":"VLOOKUP(B41,Qui!$A$201:$D$204,4)","v":1},36,null,null,null,null,null,null,null,null,null,null,null,null,null,null,null,36,null,null,null,0]
[null,{"$f":"W26","v":"Dubois"},{"$f":"X26","v":"Eric"},59,null,37,null,null,null,null,null,null,null,null,null,null,null,null,null,null,null,37,null,null,null,0]
[null,{"$f":"W27","v":"Dubois"},{"$f":"X27","v":"Emmanuel"},{"$f":"Y27","v":38},null,38,null,null,null,null,null,null,null,null,null,null,null,null,null,null,null,38,null,null,null,0]
[null,"Matthey","Pierre",24,null,39,null,null,null,null,null,null,null,null,null,null,null,null,null,null,null,39,null,null,null,0]
[null,"Jean-Mairet","Jean-Claude",13,null,40,null,null,null,null,null,null,null,null,null,null,null,null,null,null,null,40,null,null,null,0]
[null,null,null,{"$f":"SUM(D42:D45)","v":134},null,41,null,null,null,null,null,null,null,null,null,null,null,null,null,null,null,41,null,null,null,0]
[null,null,null,null,null,42,null,null,null,null,null,null,null,null,null,null,null,null,null,null,null,42,null,null,null,0]
["7ème",{"$f":"IF($D53,(INDEX($Q$6:$S$20,MATCH($AA30,$Q$6:$Q$20,0),2)),0)","v":{"$error":"#N/A"}},null,null,{"$f":"VLOOKUP(B48,Qui!$A$201:$D$204,4)","v":{"$error":"#N/A"}},43,null,null,null,null,null,null,null,null,null,null,null,null,null,null,null,43,null,null,null,0]
[null,{"$f":"W30","v":"Tinguely"},{"$f":"X30","v":"Didier"},58,{"$f":"Z33","v":0},44,null,null,null,null,null,null,null,null,null,null,null,null,null,null,null,44,null,null,null,0]
[null,{"$f":"W31","v":"Oppliger"},{"$f":"X31","v":"Hervé"},{"$f":"Y31","v":55},null,45,null,null,null,null,null,null,null,null,null,null,null,null,null,null,null,45,null,null,null,0]
[null,"Dubois","Marcel",46,null,46,null,null,null,null,null,null,null,null,null,null,null,null,null,null,null,46,null,null,null,0]
[null,"Haussener","Philippe",42,null,47,null,null,null,null,null,null,null,null,null,null,null,null,null,null,null,47,null,null,null,0]
[null,null,null,{"$f":"SUM(D49:D52)","v":201},null,48,null,null,null,null,null,null,null,null,null,null,null,null,null,null,null,48,null,null,null,0]
["8ème",{"$f":"IF($D59,(INDEX($Q$6:$S$20,MATCH($AA34,$Q$6:$Q$20,0),2)),0)","v":0},null,null,{"$f":"VLOOKUP(B54,Qui!$A$201:$D$204,4)","v":{"$error":"#N/A"}},49,null,null,null,null,null,null,null,null,null,null,null,null,null,null,null,49,null,null,null,0]
[null,{"$f":"W34","v":"Favre"},{"$f":"X34","v":"Daniel"},0]
[null,{"$f":"W35","v":"Bourquin"},{"$f":"X35","v":"Willy"},{"$f":"Y35","v":0}]
[null,"Charlet","Léon",0,null,null,null,{"$f":"CONCATENATE(\"Champion de jeu : \",H6,\" \",I6)","v":"Champion de jeu : Gerber Michel"},null,{"$f":"J6","v":111}]
[null,"Kemajl","Fetahi",0]
[null,null,null,{"$f":"SUM(D55:D58)","v":0},null,null,null,null,null,"La Chaux-de-Fonds, le 4 avril 2020, cm"]

{"sheet":"Challenge_2","index":11,"n_rows":59,"n_cols":27,"rows_kept":59,"cut":false,"hidden":true,"merged":[[0,0,0,9],[1,0,1,9],[3,16,3,18],[3,21,3,26],[56,7,56,8]]}
["Association intercantonale\n des joueurs de boules,\nGrand Jeu Neuchâtelois\n"]
[{"$f":"CONCATENATE(Calendrier!A25,\"      Jeu : \",(Calendrier!F25))","v":"Challenge ÉTÉ      Jeu : Le Locle"}]
[null,null,null,null,null,null,null,null,null,{"$f":"CONCATENATE(\"du \",TEXT(Calendrier!F27,\" jj.mm\"),\" au \",TEXT(Calendrier!F30,\" jj.mm.aaaa\"))","v":"du  15.06 au  18.06.2020"}]
["Classement par équipes",null,null,null,null,null,null,"Classement individuel",null,null,null,null,"Equipe",null,null,null,"Equipes possibles",null,null,null,null,"Equipes triées"]
[null,null,null,null,null,null,null,null,null,null,null,null,null,null,null,null,"N°","Nom","Total équipe",null,null,"Rang","Nom","Prénom","Résultat","TotEquipe","Equipe"]
["1er",{"$f":"IF($D11,(INDEX($Q$6:$S$20,MATCH($AA6,$Q$6:$Q$20,0),2)),0)","v":0},null,null,{"$f":"VLOOKUP(B6,Qui!$A$201:$D$204,4)","v":{"$error":"#N/A"}},1,null,"Bart","Fabien",0,{"$f":"IFERROR((VLOOKUP(CONCATENATE(H6,I6),Qui!$D$301:$F$356,3,0)),0)","v":3},null,null,null,null,null,"C1","La Chaux-de-Fonds  I",{"$f":"SUMIF($M$6:$M$40,\"=\"&$Q6,$J$6:$J$40)","v":0},null,null,1,"Bart","Fabien",0,{"$f":"IF($AA6<>\"\",(IF($Y6,(INDEX($Q$6:$S$20,MATCH($AA6,$Q$6:$Q$20,0),3)),0)),0)","v":0}]
[null,{"$f":"W6","v":"Bart"},{"$f":"X6","v":"Fabien"},0,null,2,null,"Billod-Morel","Gérald",0,{"$f":"IFERROR((VLOOKUP(CONCATENATE(H7,I7),Qui!$D$301:$F$356,3,0)),0)","v":1},null,null,null,null,null,"C2","La Chaux-de-Fonds  II",0,null,null,2,"Billod-Morel","Gérald",0,0]
[null,{"$f":"W7","v":"Billod-Morel"},"Gérald",0,null,3,null,"Bourquin","Willy",0,{"$f":"IFERROR((VLOOKUP(CONCATENATE(H8,I8),Qui!$D$301:$F$356,3,0)),0)","v":4},null,null,null,null,null,"E1","L'Epi I",0,null,null,3,"Bourquin","Willy",0,0]
[null,{"$f":"W8","v":"Bourquin"},"Willy",0,null,4,null,"Bühler","Raymond",0,{"$f":"IFERROR((VLOOKUP(CONCATENATE(H9,I9),Qui!$D$301:$F$356,3,0)),0)","v":4},null,null,null,null,null,"E2","L'Epi II",0,null,null,4,"Bühler","Raymond",0,0]
[null,"Bühler","Raymond",0,null,5,null,"Cassi","Alain",0,{"$f":"IFERROR((VLOOKUP(CONCATENATE(H10,I10),Qui!$D$301:$F$356,3,0)),0)","v":3},null,null,null,null,null,"L1","Le Locle I",0,null,null,5,"Cassi","Alain",0,0]
[null,null,"Total",{"$f":"SUM(D7:D10)","v":0},null,6,null,"Charlet","Léon",0,{"$f":"IFERROR((VLOOKUP(CONCATENATE(H11,I11),Qui!$D$301:$F$356,3,0)),0)","v":2},null,null,null,null,null,"L2","Le Locle II",0,null,null,6,"Charlet","Léon",0,0]
[null,null,null,null,null,7,null,"Chassot","Yves",0,{"$f":"IFERROR((VLOOKUP(CONCATENATE(H12,I12),Qui!$D$301:$F$356,3,0)),0)","v":2},null,null,null,null,null,"V1","La Vue-des-Alpes I",0,null,null,7,"Chassot","Yves",0,0]
["2ème",{"$f":"IF($D18,(INDEX($Q$6:$S$20,MATCH($AA10,$Q$6:$Q$20,0),2)),0)","v":0},null,null,{"$f":"VLOOKUP(B13,Qui!$A$201:$D$204,4)","v":{"$error":"#N/A"}},8,null,"Dick","Pierre-Alain",0,{"$f":"IFERROR((VLOOKUP(CONCATENATE(H13,I13),Qui!$D$301:$F$356,3,0)),0)","v":2},null,null,null,null,null,"V2","La Vue-des-Alpes II",0,null,null,8,"Dick","Pierre-Alain",0,0]
[null,{"$f":"W10","v":"Cassi"},{"$f":"X10","v":"Alain"},0,null,9,null,"Dubois","Emmanuel",0,{"$f":"IFERROR((VLOOKUP(CONCATENATE(H14,I14),Qui!$D$301:$F$356,3,0)),0)","v":1},null,null,null,null,null,null,null,0,null,null,9,"Dubois","Emmanuel",0,0]
[null,{"$f":"W11","v":"Charlet"},"Léon",0,null,10,null,"Dubois","Eric",0,{"$f":"IFERROR((VLOOKUP(CONCATENATE(H15,I15),Qui!$D$301:$F$356,3,0)),0)","v":1},null,null,null,null,null,null,null,0,null,null,10,"Dubois","Eric",0,0]
[null,"Chassot","Yves",0,null,11,null,"Dubois","Marcel",0,{"$f":"IFERROR((VLOOKUP(CONCATENATE(H16,I16),Qui!$D$301:$F$356,3,0)),0)","v":1},null,null,null,null,null,null,null,0,null,null,11,"Dubois","Marcel",0,0]
[null,"Dick","Pierre-Alain",0,null,12,null,"Favre","Daniel",0,{"$f":"IFERROR((VLOOKUP(CONCATENATE(H17,I17),Qui!$D$301:$F$356,3,0)),0)","v":3},null,null,null,null,null,null,null,0,null,null,12,"Favre","Daniel",0,0]
[null,null,"Total",{"$f":"SUM(D14:D17)","v":0},null,13,null,"Frutiger","Bertrand",0,{"$f":"IFERROR((VLOOKUP(CONCATENATE(H18,I18),Qui!$D$301:$F$356,3,0)),0)","v":4},null,null,null,null,null,null,null,0,null,null,13,"Frutiger","Bertrand",0,0]
[null,null,null,null,null,14,null,"Geiser","Willy",0,{"$f":"IFERROR((VLOOKUP(CONCATENATE(H19,I19),Qui!$D$301:$F$356,3,0)),0)","v":1},null,null,null,null,null,null,null,0,null,null,14,"Geiser","Willy",0,0]
["3ème",{"$f":"IF($D25,(INDEX($Q$6:$S$20,MATCH($AA14,$Q$6:$Q$20,0),2)),0)","v":0},null,null,{"$f":"VLOOKUP(B20,Qui!$A$201:$D$204,4)","v":{"$error":"#N/A"}},15,null,"Gerber","Michel",0,{"$f":"IFERROR((VLOOKUP(CONCATENATE(H20,I20),Qui!$D$301:$F$356,3,0)),0)","v":3},null,null,null,null,null,null,null,0,null,null,15,"Gerber","Michel",0,0]
[null,{"$f":"W14","v":"Dubois"},{"$f":"X14","v":"Emmanuel"},0,null,16,null,"Haussener","Philippe",0,{"$f":"IFERROR((VLOOKUP(CONCATENATE(H21,I21),Qui!$D$301:$F$356,3,0)),0)","v":2},null,null,null,null,null,null,null,null,null,null,16,"Haussener","Philippe",0,0]
[null,{"$f":"W15","v":"Dubois"},"Eric",0,null,17,null,"Jean-Mairet","Jean-Claude",0,{"$f":"IFERROR((VLOOKUP(CONCATENATE(H22,I22),Qui!$D$301:$F$356,3,0)),0)","v":1},null,null,null,null,null,null,null,null,null,null,17,"Jean-Mairet","Jean-Claude",0,0]
[null,"Dubois","Marcel",0,null,18,null,"Jeanneret","Louis",0,{"$f":"IFERROR((VLOOKUP(CONCATENATE(H23,I23),Qui!$D$301:$F$356,3,0)),0)","v":2},null,null,null,null,null,null,null,null,null,null,18,"Jeanneret","Louis",0,0]
[null,"Favre","Daniel",0,null,19,null,"Kemajl","Fetahi",0,{"$f":"IFERROR((VLOOKUP(CONCATENATE(H24,I24),Qui!$D$301:$F$356,3,0)),0)","v":3},null,null,null,null,null,null,null,null,null,null,19,"Kemajl","Fetahi",0,0]
[null,null,null,{"$f":"SUM(D21:D24)","v":0},null,20,null,"Matthey","Pierre",0,{"$f":"IFERROR((VLOOKUP(CONCATENATE(H25,I25),Qui!$D$301:$F$356,3,0)),0)","v":1},null,null,null,null,null,null,null,null,null,null,20,"Matthey","Pierre",0,0]
[null,null,null,null,null,21,null,"Monnier","Christian",0,{"$f":"IFERROR((VLOOKUP(CONCATENATE(H26,I26),Qui!$D$301:$F$356,3,0)),0)","v":1},null,null,null,null,null,null,null,null,null,null,21,"Monnier","Christian",0,0]
["4ème",{"$f":"IF($D32,(INDEX($Q$6:$S$20,MATCH($AA18,$Q$6:$Q$20,0),2)),0)","v":0},null,null,{"$f":"VLOOKUP(B27,Qui!$A$201:$D$204,4)","v":{"$error":"#N/A"}},22,null,"Mores","Blaise",0,{"$f":"IFERROR((VLOOKUP(CONCATENATE(H27,I27),Qui!$D$301:$F$356,3,0)),0)","v":4},null,null,null,null,null,null,null,null,null,null,22,"Mores","Blaise",0,0]
[null,{"$f":"W18","v":"Frutiger"},{"$f":"X18","v":"Bertrand"},0,null,23,null,"Oppliger","Hervé",0,{"$f":"IFERROR((VLOOKUP(CONCATENATE(H28,I28),Qui!$D$301:$F$356,3,0)),0)","v":2},null,null,null,null,null,null,null,null,null,null,23,"Oppliger","Hervé",0,0]
[null,{"$f":"W19","v":"Geiser"},"Willy",0,null,24,null,"Pellaton","Daniel",0,{"$f":"IFERROR((VLOOKUP(CONCATENATE(H29,I29),Qui!$D$301:$F$356,3,0)),0)","v":4},null,null,null,null,null,null,null,null,null,null,24,"Pellaton","Daniel",0,0]
[null,"Gerber","Michel",0,null,25,null,"Reichen","Sylvain",0,{"$f":"IFERROR((VLOOKUP(CONCATENATE(H30,I30),Qui!$D$301:$F$356,3,0)),0)","v":4},null,null,null,null,null,null,null,null,null,null,25,"Reichen","Sylvain",0,0]
[null,"Haussener","Philippe",0,null,26,null,"Rindlisbacher","Heinz",0,{"$f":"IFERROR((VLOOKUP(CONCATENATE(H31,I31),Qui!$D$301:$F$356,3,0)),0)","v":4},null,null,null,null,null,null,null,null,null,null,26,"Rindlisbacher","Heinz",0,0]
[null,null,"Total",{"$f":"SUM(D28:D31)","v":0},null,27,null,"Rollat","Christian",0,{"$f":"IFERROR((VLOOKUP(CONCATENATE(H32,I32),Qui!$D$301:$F$356,3,0)),0)","v":1},null,null,null,null,null,null,null,null,null,null,27,"Rollat","Christian",0,0]
[null,null,null,null,null,28,null,"Rossier","Yves-Alain",0,{"$f":"IFERROR((VLOOKUP(CONCATENATE(H33,I33),Qui!$D$301:$F$356,3,0)),0)","v":4},null,null,null,null,null,null,null,null,null,null,28,"Rossier","Yves-Alain",0,0]
["5ème",{"$f":"IF($D39,(INDEX($Q$6:$S$20,MATCH($AA22,$Q$6:$Q$20,0),2)),0)","v":0},null,null,{"$f":"VLOOKUP(B34,Qui!$A$201:$D$204,4)","v":{"$error":"#N/A"}},29,null,"Tinguely","Didier",0,{"$f":"IFERROR((VLOOKUP(CONCATENATE(H34,I34),Qui!$D$301:$F$356,3,0)),0)","v":1},null,null,null,null,null,null,null,null,null,null,29,"Tinguely","Didier",0,0]
[null,{"$f":"W22","v":"Jean-Mairet"},{"$f":"X22","v":"Jean-Claude"},0,null,30,null,"Tynowski","Lucien",0,{"$f":"IFERROR((VLOOKUP(CONCATENATE(H35,I35),Qui!$D$301:$F$356,3,0)),0)","v":3},null,null,null,null,null,null,null,null,null,null,30,"Tynowski","Lucien",0,0]
[null,{"$f":"W23","v":"Jeanneret"},"Louis",0,null,31,null,"Voirol","Pierre",0,{"$f":"IFERROR((VLOOKUP(CONCATENATE(H36,I36),Qui!$D$301:$F$356,3,0)),0)","v":1},null,null,null,null,null,null,null,null,null,null,31,"Voirol","Pierre",0,0]
[null,"Kemajl","Fetahi",0,null,32,null,"Vuillème","Claude-Alain",0,{"$f":"IFERROR((VLOOKUP(CONCATENATE(H37,I37),Qui!$D$301:$F$356,3,0)),0)","v":2},null,null,null,null,null,null,null,null,null,null,32,"Vuillème","Claude-Alain",0,0]
[null,"Matthey","Pierre",0,null,33,null,"Wäfler","Jean-Louis",0,{"$f":"IFERROR((VLOOKUP(CONCATENATE(H38,I38),Qui!$D$301:$F$356,3,0)),0)","v":4},null,null,null,null,null,null,null,null,null,null,33,"Wäfler","Jean-Louis",0,{"$f":"IF($AA38<>\"\",(IF($Y38,(INDEX($Q$6:$S$20,MATCH($AA38,$Q$6:$Q$20,0),3)),0)),0)","v":0}]
[null,null,"Total",{"$f":"SUM(D35:D38)","v":0},null,34,null,null,null,null,{"$f":"IFERROR((VLOOKUP(CONCATENATE(H39,I39),Qui!$D$301:$F$356,3,0)),0)","v":0},null,null,null,null,null,null,null,null,null,null,34,null,null,null,0]
[null,null,null,null,null,35,null,null,null,null,{"$f":"IFERROR((VLOOKUP(CONCATENATE(H40,I40),Qui!$D$301:$F$356,3,0)),0)","v":0},null,null,null,null,null,null,null,null,null,null,35,null,null,null,0]
["6ème",{"$f":"IF($D46,(INDEX($Q$6:$S$20,MATCH($AA26,$Q$6:$Q$20,0),2)),0)","v":0},null,null,{"$f":"VLOOKUP(B41,Qui!$A$201:$D$204,4)","v":{"$error":"#N/A"}},36,null,null,null,null,null,null,null,null,null,null,null,null,null,null,null,36,null,null,null,0]
[null,{"$f":"W26","v":"Monnier"},{"$f":"X26","v":"Christian"},0,null,37,null,null,null,null,null,null,null,null,null,null,null,null,null,null,null,37,null,null,null,0]
[null,{"$f":"W27","v":"Mores"},"Blaise",0,null,38,null,null,null,null,null,null,null,null,null,null,null,null,null,null,null,38,null,null,null,0]
[null,"Oppliger","Hervé",0,null,39,null,null,null,null,null,null,null,null,null,null,null,null,null,null,null,39,null,null,null,0]
[null,"Pellaton","Daniel",0,null,40,null,null,null,null,null,null,null,null,null,null,null,null,null,null,null,40,null,null,null,0]
[null,null,null,{"$f":"SUM(D42:D45)","v":0},null,41,null,null,null,null,null,null,null,null,null,null,null,null,null,null,null,41,null,null,null,0]
[null,null,null,null,null,42,null,null,null,null,null,null,null,null,null,null,null,null,null,null,null,42,null,null,null,0]
["7ème",{"$f":"IF($D53,(INDEX($Q$6:$S$20,MATCH($AA30,$Q$6:$Q$20,0),2)),0)","v":0},null,null,{"$f":"VLOOKUP(B48,Qui!$A$201:$D$204,4)","v":{"$error":"#N/A"}},43,null,null,null,null,null,null,null,null,null,null,null,null,null,null,null,43,null,null,null,0]
[null,{"$f":"W30","v":"Reichen"},{"$f":"X30","v":"Sylvain"},0,{"$f":"Z33","v":0},44,null,null,null,null,null,null,null,null,null,null,null,null,null,null,null,44,null,null,null,0]
[null,{"$f":"W31","v":"Rindlisbacher"},"Heinz",0,null,45,null,null,null,null,null,null,null,null,null,null,null,null,null,null,null,45,null,null,null,0]
[null,"Rollat","Christian",0,null,46,null,null,null,null,null,null,null,null,null,null,null,null,null,null,null,46,null,null,null,0]
[null,"Rossier","Yves-Alain",0,null,47,null,null,null,null,null,null,null,null,null,null,null,null,null,null,null,47,null,null,null,0]
[null,null,null,{"$f":"SUM(D49:D52)","v":0},null,48,null,null,null,null,null,null,null,null,null,null,null,null,null,null,null,48,null,null,null,0]
["8ème",{"$f":"IF($D59,(INDEX($Q$6:$S$20,MATCH($AA34,$Q$6:$Q$20,0),2)),0)","v":0},null,null,{"$f":"VLOOKUP(B54,Qui!$A$201:$D$204,4)","v":{"$error":"#N/A"}},49,null,null,null,null,null,null,null,null,null,null,null,null,null,null,null,49,null,null,null,0]
[null,{"$f":"W34","v":"Tinguely"},{"$f":"X34","v":"Didier"},0]
[null,{"$f":"W35","v":"Tynowski"},"Lucien",0]
[null,"Voirol","Pierre",0,null,null,null,{"$f":"CONCATENATE(\"Champion de jeu : \",H6,\" \",I6)","v":"Champion de jeu : Bart Fabien"},null,{"$f":"J6","v":0}]
[null,"Vuillème","Claude-Alain",0]
[null,null,null,{"$f":"SUM(D55:D58)","v":0},null,null,null,null,null,"La Chaux-de-Fonds, le 4 avril 2020, cm"]

{"sheet":"Challenge_GJ","index":12,"n_rows":84,"n_cols":37,"rows_kept":84,"cut":false,"hidden":true,"merged":[[56,7,56,8],[3,28,3,30],[0,0,0,9],[1,0,1,9],[3,16,3,18],[3,21,3,26]]}
["Association intercantonale\n des joueurs de boules,\nGrand Jeu Neuchâtelois\n"]
[{"$f":"CONCATENATE(Calendrier!A11,\"      Jeu : \",(Calendrier!F11))","v":"Challenge 70ème      Jeu : L'Epi"}]
[null,null,null,null,null,null,null,null,null,{"$f":"CONCATENATE(\"du\",TEXT(Calendrier!F13,\" jj.mm\"),\" au\",TEXT(Calendrier!F16,\" jj.mm.aaaa\"))","v":"du 30.03 au 02.04.2020"}]
["Classement par équipes",null,null,null,null,null,null,"Classement individuel",null,null,null,null,"Club",null,null,null,"Clubs possibles",null,null,null,null,"Equipes triées (RE_xx)",null,null,null,null,null,null,"Clubs tri"]
[null,null,null,null,null,null,null,null,null,null,null,null,null,null,null,null,"N°","Nom","Total club",null,null,"Rang","Nom","Prénom","Résultat","Total Club","Club",null,"N°","Nom","Total club"]
["1er",{"$f":"IF($D12,(INDEX($Q$6:$S$20,MATCH($AA6,$Q$6:$Q$20,0),2)),0)","v":"L'Epi"},null,null,{"$f":"VLOOKUP(B6,Qui!$A$201:$D$204,4)","v":4},1,null,"Bourquin","Willy",400,{"$f":"IFERROR((VLOOKUP(CONCATENATE(H6,I6),Q_NP_ClNom_ClNo,3,0)),0)","v":4},null,{"$f":"K6","v":4},null,null,null,{"$f":"Qui!D201","v":1},{"$f":"Qui!F201","v":"La Chaux-de-Fonds"},{"$f":"SUMPRODUCT(LARGE((CI_NoClub=$Q6)*(CI_Resultat),{1;2;3;4;5}))","v":111},null,null,1,"Bourquin","Willy",400,{"$f":"IF($AA6<>\"\",(IF($Y6,(INDEX($Q$6:$S$20,MATCH($AA6,$Q$6:$Q$20,0),3)),0)),0)","v":444},4,null,4,"L'Epi",444,{"$f":"LARGE(RE_TotClub,1)","v":444},{"$f":"LARGE(RE_TotClub,2)","v":444},{"$f":"LARGE(RE_TotClub,3)","v":444},{"$f":"LARGE(RE_TotClub,4)","v":444},null,{"$f":"INDEX(RE_TotClub,$AE$6,1)","v":{"$error":"#REF!"}}]
[null,{"$f":"W6","v":"Bourquin"},{"$f":"X6","v":"Willy"},400,null,2,null,"Charlet","Léon",200,2,null,2,null,null,null,{"$f":"Qui!D202","v":2},{"$f":"Qui!F202","v":"La Vue-des-Alpes"},{"$f":"SUMPRODUCT(LARGE((CI_NoClub=$Q7)*(CI_Resultat),{1;2;3;4;5}))","v":223},null,null,2,"Charlet","Léon",200,444,4,null,3,"Le Locle",333,{"$f":"IF((LARGE(RE_TotClub,1)<AE$6),\"qqq\",(LARGE(RE_TotClub,1)<AE$6))","v":false},{"$f":"LARGE(RE_TotClub,2)","v":444},{"$f":"LARGE(RE_TotClub,3)","v":444},{"$f":"LARGE(RE_TotClub,4)","v":444}]
[null,{"$f":"W7","v":"Charlet"},"Léon",200,null,3,null,"Bart","Fabien",100,3,null,3,null,null,null,{"$f":"Qui!D203","v":3},{"$f":"Qui!F203","v":"Le Locle"},{"$f":"SUMPRODUCT(LARGE((CI_NoClub=$Q8)*(CI_Resultat),{1;2;3;4;5}))","v":333},null,null,3,"Bart","Fabien",100,444,4,null,2,"La Vue-des-Alpes",223]
[null,{"$f":"W8","v":"Bart"},"Fabien",100,null,4,null,"Billod-Morel","Gérald",100,1,null,1,null,null,null,{"$f":"Qui!D204","v":4},{"$f":"Qui!F204","v":"L'Epi"},{"$f":"SUMPRODUCT(LARGE((CI_NoClub=$Q9)*(CI_Resultat),{1;2;3;4;5}))","v":444},null,null,4,"Billod-Morel","Gérald",100,444,4,null,1,"La Chaux-de-Fonds",111]
[null,{"$f":"W9","v":"Billod-Morel"},{"$f":"X9","v":"Gérald"},{"$f":"Y9","v":100},null,5,null,"Cassi","Alain",100,3,null,3,null,null,null,{"$f":"Qui!D205","v":5},{"$f":"Qui!F205","v":0},{"$f":"SUMPRODUCT(LARGE((CI_NoClub=$Q10)*(CI_Resultat),{1;2;3;4;5}))","v":0},null,null,5,"Cassi","Alain",100,444,4,null,5,0,0]
[null,"Cassi","Alain",100,null,6,null,"Favre","Daniel",100,3,null,3,null,null,null,null,null,{"$f":"SUMIF($M$6:$M$40,\"=\"&$Q11,$J$6:$J$40)","v":0},null,null,6,"Favre","Daniel",100,444,4,null,null,null,0]
[null,null,"Total",{"$f":"SUM(D7:D11)","v":900},null,7,null,"Gerber","Michel",30,3,null,3,null,null,null,null,null,0,null,null,7,"Gerber","Michel",30,444,4,null,null,null,0]
[null,null,null,null,null,8,null,"Bühler","Raymond",18,4,null,4,null,null,null,null,null,null,null,null,8,"Bühler","Raymond",18,444,4]
["2ème",{"$f":"IF($D20,(INDEX($Q$6:$S$20,MATCH($AA10,$Q$6:$Q$20,0),2)),0)","v":"L'Epi"},null,null,{"$f":"VLOOKUP(B14,Qui!$A$201:$D$204,4)","v":4},9,null,"Frutiger","Bertrand",12,4,null,4,null,null,null,null,null,null,null,null,9,"Frutiger","Bertrand",12,333,3]
[null,{"$f":"W10","v":"Cassi"},"Alain",100,null,10,null,"Chassot","Yves",10,2,null,2,null,null,null,null,null,null,null,null,10,"Chassot","Yves",10,333,3]
[null,"Favre","Daniel",100,null,11,null,"Dick","Pierre-Alain",10,2,null,2,null,null,null,null,null,null,null,null,11,"Dick","Pierre-Alain",10,333,3]
[null,"Gerber","Michel",30,null,12,null,"Mores","Blaise",10,4,null,4,null,null,null,null,null,null,null,null,12,"Mores","Blaise",10,333,3]
[null,"Bühler","Raymond",18,null,13,null,"Pellaton","Daniel",4,4,null,4,null,null,null,null,null,null,null,null,13,"Pellaton","Daniel",4,333,3]
[null,{"$f":"W13","v":"Bühler"},{"$f":"X13","v":"Raymond"},{"$f":"Y13","v":18},null,14,null,"Dubois","Emmanuel",3,1,null,1,null,null,null,null,null,null,null,null,14,"Dubois","Emmanuel",3,333,3]
[null,null,"Total",{"$f":"SUM(D15:D19)","v":266},null,15,null,"Dubois","Eric",3,1,null,1,null,null,null,null,null,null,null,null,15,"Dubois","Eric",3,223,2]
[null,null,null,null,null,16,null,"Dubois","Marcel",3,1,null,1,null,null,null,null,null,null,null,null,16,"Dubois","Marcel",3,223,2]
["3ème",{"$f":"IF($D28,(INDEX($Q$6:$S$20,MATCH($AA14,$Q$6:$Q$20,0),2)),0)","v":"Le Locle"},null,null,{"$f":"VLOOKUP(B22,Qui!$A$201:$D$204,4)","v":3},17,null,"Kemajl","Fetahi",3,3,null,3,null,null,null,null,null,null,null,null,17,"Kemajl","Fetahi",3,223,2]
[null,{"$f":"W14","v":"Frutiger"},"Bertrand",12,null,18,null,"Reichen","Sylvain",3,4,null,4,null,null,null,null,null,null,null,null,18,"Reichen","Sylvain",3,223,2]
[null,"Chassot","Yves",10,null,19,null,"Geiser","Willy",2,1,null,1,null,null,null,null,null,null,null,null,19,"Geiser","Willy",2,223,2]
[null,"Dick","Pierre-Alain",10,null,20,null,"Haussener","Philippe",2,2,null,2,null,null,null,null,null,null,null,null,20,"Haussener","Philippe",2,223,2]
[null,"Mores","Blaise",10,null,21,null,"Rindlisbacher","Heinz",2,4,null,4,null,null,null,null,null,null,null,null,21,"Rindlisbacher","Heinz",2,111,1]
[null,{"$f":"W17","v":"Mores"},{"$f":"X17","v":"Blaise"},{"$f":"Y17","v":10},null,22,null,"Jean-Mairet","Jean-Claude",1,1,null,1,null,null,null,null,null,null,null,null,22,"Jean-Mairet","Jean-Claude",1,111,1,4]
[null,null,null,{"$f":"SUM(D23:D27)","v":52},null,23,null,"Jeanneret","Louis",1,2,null,2,null,null,null,null,null,null,null,null,23,"Jeanneret","Louis",1,111,1]
[null,null,null,null,null,24,null,"Matthey","Pierre",1,1,null,1,null,null,null,null,null,null,null,null,24,"Matthey","Pierre",1,111,1]
["4ème",{"$f":"IF($D36,(INDEX($Q$6:$S$20,MATCH($AA18,$Q$6:$Q$20,0),2)),0)","v":"Le Locle"},null,null,{"$f":"VLOOKUP(B30,Qui!$A$201:$D$204,4)","v":3},25,null,"Monnier","Christian",1,1,null,1,null,null,null,null,null,null,null,null,25,"Monnier","Christian",1,111,1]
[null,{"$f":"W18","v":"Pellaton"},"Daniel",4,null,26,null,"Oppliger","Hervé",1,2,null,2,null,null,null,null,null,null,null,null,26,"Oppliger","Hervé",1,111,1]
[null,"Dubois","Emmanuel",3,null,27,null,"Rossier","Yves-Alain",1,4,null,4,null,null,null,null,null,null,null,null,27,"Rossier","Yves-Alain",1,111,1]
[null,"Dubois","Eric",3,null,28,null,"Tinguely","Didier",1,1,null,1,null,null,null,null,null,null,null,null,28,"Tinguely","Didier",1,111,1]
[null,"Dubois","Marcel",3,null,29,null,"Tynowski","Lucien",1,3,null,3,null,null,null,null,null,null,null,null,29,"Tynowski","Lucien",1,111,1]
[null,{"$f":"W21","v":"Dubois"},{"$f":"X21","v":"Marcel"},{"$f":"Y21","v":3},null,30,null,"Rollat","Christian",0,1,null,1,null,null,null,null,null,null,null,null,30,"Rollat","Christian",0,0,1]
[null,null,"Total",{"$f":"SUM(D31:D35)","v":16},null,31,null,"Voirol","Pierre",0,1,null,1,null,null,null,null,null,null,null,null,31,"Voirol","Pierre",0,0,1]
[null,null,null,null,null,32,null,"Vuillème","Claude-Alain",0,2,null,2,null,null,null,null,null,null,null,null,32,"Vuillème","Claude-Alain",0,0,2]
["5ème",{"$f":"IF($D43,(INDEX($Q$6:$S$20,MATCH($AA22,$Q$6:$Q$20,0),2)),0)","v":"La Vue-des-Alpes"},null,null,{"$f":"VLOOKUP(B38,Qui!$A$201:$D$204,4)","v":2},33,null,"Wäfler","Jean-Louis",0,{"$f":"IFERROR((VLOOKUP(CONCATENATE(H38,I38),Q_NP_ClNom_ClNo,3,0)),0)","v":4},null,4,null,null,null,null,null,null,null,null,33,"Wäfler","Jean-Louis",0,{"$f":"IF($AA38<>\"\",(IF($Y38,(INDEX($Q$6:$S$20,MATCH($AA38,$Q$6:$Q$20,0),3)),0)),0)","v":0},4]
[null,{"$f":"W22","v":"Kemajl"},"Fetahi",3,null,34,null,null,null,null,0,null,null,null,null,null,null,null,null,null,null,34,null,null,null,0,0]
[null,"Reichen","Sylvain",3,null,35,null,null,null,null,0,null,null,null,null,null,null,null,null,null,null,35,null,null,null,0,0]
[null,"Geiser","Willy",2,null,36,null,null,null,null,0,null,null,null,null,null,null,null,null,null,null,36,null,null,null,0]
[null,"Haussener","Philippe",2,null,37,null,null,null,null,0,null,null,null,null,null,null,null,null,null,null,37,null,null,null,0]
[null,null,"Total",{"$f":"SUM(D39:D42)","v":10},null,38,null,null,null,null,0,null,null,null,null,null,null,null,null,null,null,38,null,null,null,0]
[null,null,null,null,null,39,null,null,null,null,0,null,null,null,null,null,null,null,null,null,null,39,null,null,null,0]
["6ème",{"$f":"IF($D51,(INDEX($Q$6:$S$20,MATCH($AA26,$Q$6:$Q$20,0),2)),0)","v":"La Chaux-de-Fonds"},null,null,{"$f":"VLOOKUP(B45,Qui!$A$201:$D$204,4)","v":1},40,null,null,null,null,0,null,null,null,null,null,null,null,null,null,null,40,null,null,null,0]
[null,{"$f":"W26","v":"Rindlisbacher"},"Heinz",2,null,41,null,null,null,null,0,null,null,null,null,null,null,null,null,null,null,41,null,null,null,0]
[null,"Jean-Mairet","Jean-Claude",1,null,42,null,null,null,null,0,null,null,null,null,null,null,null,null,null,null,42,null,null,null,0]
[null,"Jeanneret","Louis",1,null,43,null,null,null,null,0,null,null,null,null,null,null,null,null,null,null,43,null,null,null,0]
[null,"Matthey","Pierre",1,null,44,null,null,null,null,0,null,null,null,null,null,null,null,null,null,null,44,null,null,null,0]
[null,{"$f":"W29","v":"Matthey"},{"$f":"X29","v":"Pierre"},{"$f":"Y29","v":1},null,45,null,null,null,null,0,null,null,null,null,null,null,null,null,null,null,45,null,null,null,0]
[null,null,null,{"$f":"SUM(D46:D50)","v":6},null,46,null,null,null,null,0,null,null,null,null,null,null,null,null,null,null,46,null,null,null,0]
[null,null,null,null,null,47,null,null,null,null,0,null,null,null,null,null,null,null,null,null,null,47,null,null,null,0]
[null,null,null,null,null,48,null,null,null,null,0,null,null,null,null,null,null,null,null,null,null,48,null,null,null,0]
[null,null,null,null,null,49,null,null,null,null,0,null,null,null,null,null,null,null,null,null,null,49,null,null,null,0]
[]
[]
[null,null,null,null,null,null,null,{"$f":"CONCATENATE(\"Champion de jeu : \",H6,\" \",I6)","v":"Champion de jeu : Bourquin Willy"},null,{"$f":"J6","v":400}]
[]
[null,null,null,null,null,null,null,null,null,"La Chaux-de-Fonds, le 4 avril 2020, cm"]
[]
[]
[null,null,null,null,null,null,null,null,null,null,null,null,null,null,null,null,null,"Résultat club"]
[null,null,null,null,null,null,null,null,null,null,null,null,null,null,null,null,null,{"$f":"LARGE($S$6:$S$12,1)","v":444}]
[null,null,null,null,null,null,null,null,null,null,null,null,null,null,null,null,null,{"$f":"LARGE($S$6:$S$12,2)","v":333}]
[null,null,null,null,null,null,null,null,null,null,null,null,null,null,null,null,null,{"$f":"LARGE($S$6:$S$12,3)","v":223}]
[null,null,null,null,null,null,null,null,null,null,null,null,null,null,null,null,null,{"$f":"LARGE($S$6:$S$12,4)","v":111}]
[null,null,null,null,null,null,null,null,null,null,null,null,null,null,null,null,null,{"$f":"LARGE($S$6:$S$12,5)","v":0}]
[]
[]
[]
[]
[null,null,null,null,null,null,null,null,null,null,null,null,null,null,null,null,null,{"$f":"IF(ROW()=1,#REF!,INDEX($A$2:$A$100,(ROW()-2)*5+5))","v":{"$error":"#REF!"}}]
[null,null,null,null,null,null,null,null,null,null,null,null,null,null,null,null,null,{"$f":"INDEX(L63:P111,7,2)","v":0}]
[null,null,null,null,null,null,null,null,null,null,null,null,null,null,null,null,null,{"$f":"IF(ROWS(#REF!)>$B$3,\"\",INDEX(#REF!,SMALL(IF((#REF!>=$B$1)*(#REF!<=$B$2),ROW(#REF!)-ROW(#REF!)+1),ROWS(#REF!))))","v":{"$error":"#REF!"}}]
[null,null,null,null,null,null,null,null,null,null,null,null,null,null,null,null,null,{"$f":"LARGE(O63:O111,3)","v":{"$error":"#NUM!"}},{"$f":"VLOOKUP(#REF!,$Z$6:$Z$54,1,0)","v":{"$error":"#REF!"}},{"$f":"VLOOKUP(#REF!,$Z$6:$Z$54,1,0)","v":{"$error":"#REF!"}}]
[null,null,null,null,null,null,null,null,null,null,null,null,null,null,null,null,null,{"$f":"INDEX(L63:N71, 3,2)","v":0},{"$f":"VLOOKUP(#REF!,$Z$6:$Z$54,1,0)","v":{"$error":"#REF!"}},{"$f":"VLOOKUP(#REF!,$Z$6:$Z$54,1,0)","v":{"$error":"#REF!"}}]
[null,null,null,null,null,null,null,null,null,null,null,null,null,null,null,null,null,null,{"$f":"VLOOKUP(#REF!,$Z$6:$Z$54,1,0)","v":{"$error":"#REF!"}},{"$f":"VLOOKUP(#REF!,$Z$6:$Z$54,1,0)","v":{"$error":"#REF!"}}]
[null,null,null,null,null,null,null,null,null,null,null,null,null,null,null,null,null,null,{"$f":"VLOOKUP(#REF!,$Z$6:$Z$54,1,0)","v":{"$error":"#REF!"}},{"$f":"VLOOKUP(#REF!,$Z$6:$Z$54,1,0)","v":{"$error":"#REF!"}}]
[null,null,null,null,null,null,null,null,null,null,null,null,null,null,null,null,null,null,{"$f":"VLOOKUP(#REF!,$Z$6:$Z$54,1,0)","v":{"$error":"#REF!"}},{"$f":"VLOOKUP(#REF!,$Z$6:$Z$54,1,0)","v":{"$error":"#REF!"}}]
[null,null,null,null,null,null,null,null,null,null,null,null,null,null,null,null,null,null,{"$f":"VLOOKUP(#REF!,$Z$6:$Z$54,1,0)","v":{"$error":"#REF!"}},{"$f":"VLOOKUP(#REF!,$Z$6:$Z$54,1,0)","v":{"$error":"#REF!"}}]
[null,null,null,null,null,null,null,null,null,null,null,null,null,null,null,null,null,null,{"$f":"VLOOKUP(#REF!,$Z$6:$Z$54,1,0)","v":{"$error":"#REF!"}},{"$f":"VLOOKUP(#REF!,$Z$6:$Z$54,1,0)","v":{"$error":"#REF!"}}]
[]
[]
[null,null,null,null,null,null,null,null,null,null,null,null,null,null,null,null,null,{"$f":"INDEX($Z$6:$Z$54,MIN(IF(COUNTIF(#REF!,$Z$6:$Z$54),ROW(O$54)-ROW()+1,ROW($Z$6:$Z$54)-ROW()+1)))","v":{"$error":"#REF!"}}]

{"sheet":"Champions_AN","index":13,"n_rows":42,"n_cols":5,"rows_kept":42,"cut":false,"hidden":true,"merged":[[0,0,0,4],[1,1,1,4]]}
["Association intercantonale \ndes joueurs de boules\nGrand Jeu Neuchâtelois"]
[null,{"$f":"CONCATENATE(\"Récapitulatif pour l'année   \",YEAR(Calendrier!B6))","v":"Récapitulatif pour l'année   2020"}]
[]
[]
[]
[null,{"$f":"Calendrier!A4","v":"Challenge HIVER"},{"$f":"Calendrier!F4","v":"Evologia"},{"$f":"Challenge_1!H57","v":"Champion de jeu : Gerber Michel"},{"$f":"Challenge_1!J57","v":111}]
[null,null,{"$f":"Challenge_1!J3","v":"du  09.03 au  12.03.2020"},{"$f":"CONCATENATE(\"Par équipe : \",(Challenge_1!$B$6))","v":"Par équipe : Le Locle I"},{"$f":"Challenge_1!D11","v":400}]
[]
[null,{"$f":"Calendrier!A25","v":"Challenge ÉTÉ"},{"$f":"Calendrier!F25","v":"Le Locle"},{"$f":"Challenge_2!H42","v":0},{"$f":"Challenge_2!J42","v":0}]
[null,null,{"$f":"Challenge_2!J3","v":"du  15.06 au  18.06.2020"},{"$f":"CONCATENATE(\"Par équipe : \",(Challenge_2!$B$6))","v":"Par équipe : 0"},{"$f":"Challenge_2!D11","v":0}]
[]
[null,{"$f":"Calendrier!A11","v":"Challenge 70ème"},{"$f":"Calendrier!F11","v":"L'Epi"},null,{"$f":"Manche_1!$R$5","v":0}]
[]
[]
[null,{"$f":"Calendrier!A18","v":"COUPE SUISSE"},{"$f":"Calendrier!F18","v":"La  Vue-des-Alpes"}]
[null,null,{"$f":"Calendrier!F23","v":"2020-05-09"}]
[]
[]
[null,{"$f":"Calendrier!A40","v":"Championnat 1ère manche"},{"$f":"Calendrier!F40","v":"Le Locle"},{"$f":"Manche_1!$P$4","v":"Champion de jeu : \nBart Fabien"},{"$f":"Manche_1!$R$5","v":0}]
[null,null,{"$f":"Manche_1!U3","v":" 29.06 au 02.07.2020"},{"$f":"CONCATENATE(\"Par équipe : \",(Manche_1!$P$62))","v":"Par équipe : La Chaux-de-Fonds"},{"$f":"Manche_1!$R$62","v":0}]
[]
[null,{"$f":"Calendrier!A47","v":"Championnat 2ème manche"},{"$f":"Calendrier!F47","v":"Grand-Sommartel"},{"$f":"Manche_2!$P$4","v":"Champion de jeu : \n "},{"$f":"Manche_2!$R$5","v":0}]
[null,null,{"$f":"Manche_2!U3","v":" 24.08 au 27.08.2020"},{"$f":"CONCATENATE(\"Par équipe : \",(Manche_2!$P$62))","v":"Par équipe : "},{"$f":"Manche_2!$R$62","v":0}]
[]
[null,{"$f":"Calendrier!A54","v":"Championnat 3ème manche"},{"$f":"Calendrier!F54","v":"L'Epi"},{"$f":"Manche_3!$P$4","v":"Champion de jeu : \n "},{"$f":"Manche_3!$R$5","v":0}]
[null,null,{"$f":"Manche_3!U3","v":" 07.09 au 10.09.2020"},{"$f":"CONCATENATE(\"Par équipe : \",(Manche_3!$P$62))","v":"Par équipe : "},{"$f":"Manche_3!$R$62","v":0}]
[]
[null,{"$f":"Calendrier!A61","v":"Championnat 4ème manche"},{"$f":"Calendrier!F61","v":"La  Chaux-de-Fonds"},{"$f":"Manche_4!$P$4","v":"Champion de jeu : \n "},{"$f":"Manche_4!$R$5","v":0}]
[null,null,{"$f":"Manche_4!U3","v":" 05.10 au 08.10.2020"},{"$f":"CONCATENATE(\"Par équipe : \",(Manche_4!$P$62))","v":"Par équipe : "},{"$f":"Manche_4!$R$62","v":0}]
[]
[null,{"$f":"Calendrier!A68","v":"Championnat 5ème manche"},{"$f":"Calendrier!F68","v":"Evologia"},{"$f":"Manche_5!$P$4","v":"Champion de jeu : \n "},{"$f":"Manche_5!$R$5","v":0}]
[null,null,{"$f":"Manche_5!U3","v":" 26.10 au 29.10.2020"},{"$f":"CONCATENATE(\"Par équipe : \",(Manche_5!$P$62))","v":"Par équipe : "},{"$f":"Manche_5!$R$62","v":0}]
[]
[null,{"$f":"Calendrier!A75","v":"Championnat 6ème manche"},{"$f":"Calendrier!F75","v":"La  Vue-des-Alpes"},{"$f":"Manche_6!$P$4","v":"Champion de jeu : \n "},{"$f":"Manche_6!$R$5","v":0}]
[null,null,{"$f":"Manche_6!U3","v":" 09.11 au 12.11.2020"},{"$f":"CONCATENATE(\"Par équipe : \",(Manche_6!$P$62))","v":"Par équipe : "},{"$f":"Manche_6!$R$62","v":0}]
[]
[null,{"$f":"Calendrier!A82","v":0},null,{"$f":"Manche_7!$P$4","v":"Champion de jeu : \n "},{"$f":"Manche_7!$R$5","v":0}]
[null,{"$f":"Calendrier!F82","v":0},null,{"$f":"CONCATENATE(\"Par équipe : \",(Manche_7!$P$62))","v":"Par équipe : "},{"$f":"Manche_7!$R$62","v":0}]
[]
[]
[null,"Classement général",null,{"$f":"CONCATENATE(\"Champion des jeux : \",Manche_7!$B$5,\" \",Manche_7!$C$5)","v":"Champion des jeux :  "},{"$f":"Manche_7!$M$5","v":{"$error":"#NUM!"}}]
[null,null,null,{"$f":"CONCATENATE(\"Par équipe : \",Manche_7!$B$62)","v":"Par équipe : "},{"$f":"Manche_7!$M$62","v":{"$error":"#NUM!"}}]

{"sheet":"A Ameliorer","index":14,"n_rows":12,"n_cols":5,"rows_kept":12,"cut":false,"hidden":true,"merged":[]}
["Date","Qui","Accepté","Réalisé ","Quoi"]
["2019-09-01","Daniel",null,"2020-02-02","Mentionner la date d'arrivée dans l'Intercantonale pour chaque joueur ==> jubilaire"]
["2019-09-01","Daniel",null,"2020-02-02","Mentionner la date de naissance pour chaque joueur ==> sympa"]
["2019-09-01","Daniel","2020-04-09",null,"Intégrer toutes les compétitions"]
["2019-10-31","Daniel",null,"2019-12-31","Interdiction de relancer Tri si déjà fait"]
["2019-09-17","Daniel",null,"2019-09-17","Affichage des chiffres à virgule ==> suppression des décimales "]
["2019-09-17","Daniel",null,"2019-09-17","Addition totaux équipe manche 2"]
["2019-10-09","Daniel",null,"2019-10-09","Interdiction de relancer Préparationi déjà fait"]
[]
[]
[null,null,"2020-04-09",null,"Intégrer coupe suisse"]
[null,null,"2020-04-10",null,"Intégrer challenge 70ème"]