{"text_format":"1","workbook":"xlsx","n_sheets":15,"sheets":["Calendrier","Qui","Comment","Manche_1","Manche_2","Manche_3","Manche_4","Manche_5","Manche_6","Manche_7","Challenge_1","Challenge_2","Challenge_GJ","Champions_AN","A Ameliorer"],"not_rendered":{"charts":0,"images":3,"macros":1,"external_links":0,"defined_names":26,"comments":0,"pivot_tables":0},"unopened":[],"bounds":{"document_bytes":16777216,"sheet_cells":100000,"rows_first":2000,"rows_last":500,"rows_between":2000,"halvings":0,"cell_chars":16384,"cell_head_chars":4096},"cells_cut":0,"cells_raw":0,"read":"whole","date_system":"1900"}

{"sheet":"Calendrier","index":0,"n_rows":204,"n_cols":20,"rows_kept":204,"cut":false,"hidden":false,"merged":[[10,0,10,2],[10,5,10,6],[0,0,0,7],[1,0,1,2],[1,4,1,7],[3,0,3,2],[3,5,3,6],[53,0,53,2],[53,5,53,6],[17,0,17,2],[17,5,17,6],[21,4,21,7],[24,0,24,2],[24,5,24,6],[31,0,31,2],[31,3,37,5],[31,6,37,7],[38,0,38,7],[39,0,39,2],[39,5,39,6],[46,0,46,2],[46,5,46,6],[91,2,91,6],[92,2,92,6],[92,0,92,1],[60,0,60,2],[60,5,60,6],[67,0,67,2],[67,5,67,6],[74,0,74,2],[74,5,74,6],[87,0,87,2],[87,5,87,6],[89,0,89,7],[91,0,91,1],[81,0,81,2],[81,5,81,6]]}
["GRAND JEU NEUCHATELOIS",null,null,null,null,null,null,null,null,"mettre votre\nclub en évidence",null,2020,2019,2018,2017,2016,2015,2014,2013,2012]
["Entraînements",null,null,null,{"$f":"CONCATENATE(\"Compétitions \",YEAR(B6))","v":"Compétitions 2020"}]
[]
["Challenge HIVER",null,null,null,"Jeu :","Evologia",null,"Marquage",null,null,null,"Evologia","La  Vue-des-Alpes","La Chaux-de-Fonds","L'Epi","La  Vue-des-Alpes","La Chaux-de-Fonds","La Chaux-de-Fonds","L'Epi","La  Vue-des-Alpes"]
[]
["Lundi","2020-03-02","Le Locle",null,"Lundi",{"$f":"B6+7","v":"2020-03-09"},"Le Locle","La Vue-des-Alpes"]
{"$rows_left_out":199}
{"sheet":"Qui","index":1,"n_rows":513,"n_cols":16,"rows_kept":513,"cut":false,"hidden":true,"merged":[[196,8,196,9],[199,8,199,9],[413,2,416,2]]}
[]
[]
[]
[]
[]
[]
{"$rows_left_out":508}
{"sheet":"Comment","index":2,"n_rows":181,"n_cols":6,"rows_kept":181,"cut":false,"hidden":true,"merged":[]}
["Onglet Calendrier"]
[]
["Choisir la compétition dans la liste déroulante "]
["Choisir le Jeu (pont) dans la liste déroulante"]
["Remplir la première date de l'entrainement et les suivantes se mettent automatiquement"]
["Choisir les clubs marqueurs (Un décompte du nombre de marquages ce fait automatiquement)"]
{"$rows_left_out":176}
{"sheet":"Manche_1","index":3,"n_rows":199,"n_cols":21,"rows_kept":199,"cut":false,"hidden":true,"merged":[[73,1,73,17],[0,0,0,17],[1,0,1,17],[2,0,2,1],[2,15,2,17],[3,15,3,17],[60,1,60,2],[60,15,60,16],[67,1,67,2],[68,12,68,17],[70,1,70,17],[71,1,71,17],[72,1,72,17]]}
["Association intercantonale \ndes joueurs de boules\nGrand Jeu Neuchâtelois"]
[{"$f":"CONCATENATE(\"Championnat grand jeu neuchâtelois \",YEAR(Calendrier!B6))","v":"Championnat grand jeu neuchâtelois 2020"}]
["Classement général individuel",null,"Manches",{"$f":"Calendrier!F40","v":"Le Locle"},{"$f":"Calendrier!F47","v":"Grand-Sommartel"},{"$f":"Calendrier!F54","v":"L'Epi"},{"$f":"Calendrier!F61","v":"La  Chaux-de-Fonds"},{"$f":"Calendrier!F68","v":"Evologia"},{"$f":"Calendrier!F75","v":"La  Vue-des-Alpes"},{"$f":"Calendrier!F82","v":"00:00:00"},null,null,{"$f":"CONCATENATE(\"Général\",CHAR(10),\"les \",Qui!$A$402,\" meilleurs\")","v":"Général\nles 5 meilleurs"},null,null,{"$f":"CONCATENATE(\"Classement de la manche\",CHAR(10),Calendrier!F40,CHAR(10),\"du\",TEXT(Calendrier!F42,\" jj.mm\"),\" au\",TEXT(Calendrier!F45,\" jj.mm.aaaa\"))","v":"Classement de la manche\nLe Locle\ndu 29.06 au 02.07.2020"},null,null,null,null,{"$f":"CONCATENATE(TEXT(Calendrier!F42,\" jj.mm\"),\" au\",TEXT(Calendrier!F45,\" jj.mm.aaaa\"))","v":" 29.06 au 02.07.2020"}]
[null,null,null,1,2,3,4,5,6,7,8,9,null,null,null,{"$f":"CONCATENATE(\"Champion de jeu : \",CHAR(10),P5,\" \",Q5)","v":"Champion de jeu : \nBart Fabien"}]
[1,"Bart","Fabien",0,0,0,0,0,0,0,null,null,{"$f":"SUM(D5:L5*(D5:L5>=LARGE(D5:L5,Qui!$A$402)))","v":0},{"$f":"IFERROR((VLOOKUP(CONCATENATE(B5,C5),Qui!$D$301:$F$356,3,)),0)","v":3},1,"Bart","Fabien",0,{"$f":"IFERROR((VLOOKUP(CONCATENATE(P5,Q5),Qui!$D$301:$F$356,3,0)),0)","v":3}]
[2,"Billod-Morel","Gérald",0,0,0,0,0,0,0,null,null,{"$f":"SUM(D6:L6*(D6:L6>=LARGE(D6:L6,Qui!$A$402)))","v":0},{"$f":"IFERROR((VLOOKUP(CONCATENATE(B6,C6),Qui!$D$301:$F$356,3,)),0)","v":1},2,"Billod-Morel","Gérald",0,{"$f":"IFERROR((VLOOKUP(CONCATENATE(P6,Q6),Qui!$D$301:$F$356,3,0)),0)","v":1}]
{"$rows_left_out":194}
{"sheet":"Manche_2","index":4,"n_rows":199,"n_cols":21,"rows_kept":199,"cut":false,"hidden":true,"merged":[[73,1,73,17],[0,0,0,17],[1,0,1,17],[2,0,2,1],[2,15,2,17],[3,15,3,17],[60,1,60,2],[60,15,60,16],[67,1,67,2],[68,12,68,17],[70,1,70,17],[71,1,71,17],[72,1,72,17]]}
["Association intercantonale \ndes joueurs de boules\nGrand Jeu Neuchâtelois"]
[{"$f":"CONCATENATE(\"Championnat grand jeu neuchâtelois \",YEAR(Calendrier!B6))","v":"Championnat grand jeu neuchâtelois 2020"}]
["Classement général individuel",null,"Manches",{"$f":"Calendrier!F40","v":"Le Locle"},{"$f":"Calendrier!F47","v":"Grand-Sommartel"},{"$f":"Calendrier!F54","v":"L'Epi"},{"$f":"Calendrier!F61","v":"La  Chaux-de-Fonds"},{"$f":"Calendrier!F68","v":"Evologia"},{"$f":"Calendrier!F75","v":"La  Vue-des-Alpes"},{"$f":"Calendrier!F82","v":"00:00:00"},null,null,{"$f":"CONCATENATE(\"Général\",CHAR(10),\"les \",Qui!$A$402,\" meilleurs\")","v":"Général\nles 5 meilleurs"},null,null,{"$f":"CONCATENATE(\"Classement de la manche\",CHAR(10),Calendrier!F47,CHAR(10),\"du\",TEXT(Calendrier!F49,\" jj.mm\"),\" au\",TEXT(Calendrier!F52,\" jj.mm.aaaa\"))","v":"Classement de la manche\nGrand-Sommartel\ndu 24.08 au 27.08.2020"},null,null,null,null,{"$f":"CONCATENATE(TEXT(Calendrier!F49,\" jj.mm\"),\" au\",TEXT(Calendrier!F52,\" jj.mm.aaaa\"))","v":" 24.08 au 27.08.2020"}]
[null,null,null,1,2,3,4,5,6,7,8,9,null,null,null,{"$f":"CONCATENATE(\"Champion de jeu : \",CHAR(10),P5,\" \",Q5)","v":"Champion de jeu : \n "}]
[1,null,null,null,null,null,null,null,null,null,null,null,{"$f":"SUM(D5:L5*(D5:L5>=LARGE(D5:L5,Qui!$A$402)))","v":{"$error":"#NUM!"}},{"$f":"IFERROR((VLOOKUP(CONCATENATE(B5,C5),Qui!$D$301:$F$356,3,)),0)","v":0},1,null,null,0,{"$f":"IFERROR((VLOOKUP(CONCATENATE(P5,Q5),Qui!$D$301:$F$356,3,0)),0)","v":0}]
[2,null,null,null,null,null,null,null,null,null,null,null,{"$f":"SUM(D6:L6*(D6:L6>=LARGE(D6:L6,Qui!$A$402)))","v":{"$error":"#NUM!"}},{"$f":"IFERROR((VLOOKUP(CONCATENATE(B6,C6),Qui!$D$301:$F$356,3,)),0)","v":0},2,null,null,0,{"$f":"IFERROR((VLOOKUP(CONCATENATE(P6,Q6),Qui!$D$301:$F$356,3,0)),0)","v":0}]
{"$rows_left_out":194}
{"sheet":"Manche_3","index":5,"n_rows":199,"n_cols":21,"rows_kept":199,"cut":false,"hidden":true,"merged":[[73,1,73,17],[0,0,0,17],[1,0,1,17],[2,0,2,1],[2,15,2,17],[3,15,3,17],[60,1,60,2],[60,15,60,16],[67,1,67,2],[68,12,68,17],[70,1,70,17],[71,1,71,17],[72,1,72,17]]}
["Association intercantonale \ndes joueurs de boules\nGrand Jeu Neuchâtelois"]
[{"$f":"CONCATENATE(\"Championnat grand jeu neuchâtelois \",YEAR(Calendrier!B6))","v":"Championnat grand jeu neuchâtelois 2020"}]
["Classement général individuel",null,"Manches",{"$f":"Calendrier!F40","v":"Le Locle"},{"$f":"Calendrier!F47","v":"Grand-Sommartel"},{"$f":"Calendrier!F54","v":"L'Epi"},{"$f":"Calendrier!F61","v":"La  Chaux-de-Fonds"},{"$f":"Calendrier!F68","v":"Evologia"},{"$f":"Calendrier!F75","v":"La  Vue-des-Alpes"},{"$f":"Calendrier!F82","v":"00:00:00"},null,null,{"$f":"CONCATENATE(\"Général\",CHAR(10),\"les \",Qui!$A$402,\" meilleurs\")","v":"Général\nles 5 meilleurs"},null,null,{"$f":"CONCATENATE(\"Classement de la manche\",CHAR(10),Calendrier!F54,CHAR(10),\"du\",TEXT(Calendrier!F56,\" jj.mm\"),\" au\",TEXT(Calendrier!F59,\" jj.mm.aaaa\"))","v":"Classement de la manche\nL'Epi\ndu 07.09 au 10.09.2020"},null,null,null,null,{"$f":"CONCATENATE(TEXT(Calendrier!F56,\" jj.mm\"),\" au\",TEXT(Calendrier!F59,\" jj.mm.aaaa\"))","v":" 07.09 au 10.09.2020"}]
[null,null,null,1,2,3,4,5,6,7,8,9,null,null,null,{"$f":"CONCATENATE(\"Champion de jeu : \",CHAR(10),P5,\" \",Q5)","v":"Champion de jeu : \n "}]
[1,null,null,null,null,null,null,null,null,null,null,null,{"$f":"SUM(D5:L5*(D5:L5>=LARGE(D5:L5,Qui!$A$402)))","v":{"$error":"#NUM!"}},{"$f":"IFERROR((VLOOKUP(CONCATENATE(B5,C5),Qui!$D$301:$F$356,3,)),0)","v":0},1,null,null,0,{"$f":"IFERROR((VLOOKUP(CONCATENATE(P5,Q5),Qui!$D$301:$F$356,3,0)),0)","v":0}]
[2,null,null,null,null,null,null,null,null,null,null,null,{"$f":"SUM(D6:L6*(D6:L6>=LARGE(D6:L6,Qui!$A$402)))","v":{"$error":"#NUM!"}},{"$f":"IFERROR((VLOOKUP(CONCATENATE(B6,C6),Qui!$D$301:$F$356,3,)),0)","v":0},2,null,null,0,{"$f":"IFERROR((VLOOKUP(CONCATENATE(P6,Q6),Qui!$D$301:$F$356,3,0)),0)","v":0}]
{"$rows_left_out":194}
{"sheet":"Manche_4","index":6,"n_rows":199,"n_cols":21,"rows_kept":199,"cut":false,"hidden":true,"merged":[[73,1,73,17],[0,0,0,17],[1,0,1,17],[2,0,2,1],[2,15,2,17],[3,15,3,17],[60,1,60,2],[60,15,60,16],[67,1,67,2],[68,12,68,17],[70,1,70,17],[71,1,71,17],[72,1,72,17]]}
["Association intercantonale \ndes joueurs de boules\nGrand Jeu Neuchâtelois"]
[{"$f":"CONCATENATE(\"Championnat grand jeu neuchâtelois \",YEAR(Calendrier!B6))","v":"Championnat grand jeu neuchâtelois 2020"}]
["Classement général individuel",null,"Manches",{"$f":"Calendrier!F40","v":"Le Locle"},{"$f":"Calendrier!F47","v":"Grand-Sommartel"},{"$f":"Calendrier!F54","v":"L'Epi"},{"$f":"Calendrier!F61","v":"La  Chaux-de-Fonds"},{"$f":"Calendrier!F68","v":"Evologia"},{"$f":"Calendrier!F75","v":"La  Vue-des-Alpes"},{"$f":"Calendrier!F82","v":"00:00:00"},null,null,{"$f":"CONCATENATE(\"Général\",CHAR(10),\"les \",Qui!$A$402,\" meilleurs\")","v":"Général\nles 5 meilleurs"},null,null,{"$f":"CONCATENATE(\"Classement de la manche\",CHAR(10),Calendrier!F61,CHAR(10),\"du\",TEXT(Calendrier!F63,\" jj.mm\"),\" au\",TEXT(Calendrier!F66,\" jj.mm.aaaa\"))","v":"Classement de la manche\nLa  Chaux-de-Fonds\ndu 05.10 au 08.10.2020"},null,null,null,null,{"$f":"CONCATENATE(TEXT(Calendrier!F63,\" jj.mm\"),\" au\",TEXT(Calendrier!F66,\" jj.mm.aaaa\"))","v":" 05.10 au 08.10.2020"}]
[null,null,null,1,2,3,4,5,6,7,8,9,null,null,null,{"$f":"CONCATENATE(\"Champion de jeu : \",CHAR(10),P5,\" \",Q5)","v":"Champion de jeu : \n "}]
[1,null,null,null,null,null,null,null,null,null,null,null,{"$f":"SUM(D5:L5*(D5:L5>=LARGE(D5:L5,Qui!$A$402)))","v":{"$error":"#NUM!"}},{"$f":"IFERROR((VLOOKUP(CONCATENATE(B5,C5),Qui!$D$301:$F$356,3,)),0)","v":0},1,null,null,0,{"$f":"IFERROR((VLOOKUP(CONCATENATE(P5,Q5),Qui!$D$301:$F$356,3,0)),0)","v":0}]
[2,null,null,null,null,null,null,null,null,null,null,null,{"$f":"SUM(D6:L6*(D6:L6>=LARGE(D6:L6,Qui!$A$402)))","v":{"$error":"#NUM!"}},{"$f":"IFERROR((VLOOKUP(CONCATENATE(B6,C6),Qui!$D$301:$F$356,3,)),0)","v":0},2,null,null,0,{"$f":"IFERROR((VLOOKUP(CONCATENATE(P6,Q6),Qui!$D$301:$F$356,3,0)),0)","v":0}]
{"$rows_left_out":194}
{"sheet":"Manche_5","index":7,"n_rows":199,"n_cols":21,"rows_kept":199,"cut":false,"hidden":true,"merged":[[73,1,73,17],[0,0,0,17],[1,0,1,17],[2,0,2,1],[2,15,2,17],[3,15,3,17],[60,1,60,2],[60,15,60,16],[67,1,67,2],[68,12,68,17],[70,1,70,17],[71,1,71,17],[72,1,72,17]]}
["Association intercantonale \ndes joueurs de boules\nGrand Jeu Neuchâtelois"]
[{"$f":"CONCATENATE(\"Championnat grand jeu neuchâtelois \",YEAR(Calendrier!B6))","v":"Championnat grand jeu neuchâtelois 2020"}]
["Classement général individuel",null,"Manches",{"$f":"Calendrier!F40","v":"Le Locle"},{"$f":"Calendrier!F47","v":"Grand-Sommartel"},{"$f":"Calendrier!F54","v":"L'Epi"},{"$f":"Calendrier!F61","v":"La  Chaux-de-Fonds"},{"$f":"Calendrier!F68","v":"Evologia"},{"$f":"Calendrier!F75","v":"La  Vue-des-Alpes"},{"$f":"Calendrier!F82","v":"00:00:00"},null,null,{"$f":"CONCATENATE(\"Général\",CHAR(10),\"les \",Qui!$A$402,\" meilleurs\")","v":"Général\nles 5 meilleurs"},null,null,{"$f":"CONCATENATE(\"Classement de la manche\",CHAR(10),Calendrier!F68,CHAR(10),\"du\",TEXT(Calendrier!F70,\" jj.mm\"),\" au\",TEXT(Calendrier!F73,\" jj.mm.aaaa\"))","v":"Classement de la manche\nEvologia\ndu 26.10 au 29.10.2020"},null,null,null,null,{"$f":"CONCATENATE(TEXT(Calendrier!F70,\" jj.mm\"),\" au\",TEXT(Calendrier!F73,\" jj.mm.aaaa\"))","v":" 26.10 au 29.10.2020"}]
[null,null,null,1,2,3,4,5,6,7,8,9,null,null,null,{"$f":"CONCATENATE(\"Champion de jeu : \",CHAR(10),P5,\" \",Q5)","v":"Champion de jeu : \n "}]
[1,null,null,null,null,null,null,null,null,null,null,null,{"$f":"SUM(D5:L5*(D5:L5>=LARGE(D5:L5,Qui!$A$402)))","v":{"$error":"#NUM!"}},{"$f":"IFERROR((VLOOKUP(CONCATENATE(B5,C5),Qui!$D$301:$F$356,3,)),0)","v":0},1,null,null,0,{"$f":"IFERROR((VLOOKUP(CONCATENATE(P5,Q5),Qui!$D$301:$F$356,3,0)),0)","v":0}]
[2,null,null,null,null,null,null,null,null,null,null,null,{"$f":"SUM(D6:L6*(D6:L6>=LARGE(D6:L6,Qui!$A$402)))","v":{"$error":"#NUM!"}},{"$f":"IFERROR((VLOOKUP(CONCATENATE(B6,C6),Qui!$D$301:$F$356,3,)),0)","v":0},2,null,null,0,{"$f":"IFERROR((VLOOKUP(CONCATENATE(P6,Q6),Qui!$D$301:$F$356,3,0)),0)","v":0}]
{"$rows_left_out":194}
{"sheet":"Manche_6","index":8,"n_rows":74,"n_cols":21,"rows_kept":74,"cut":false,"hidden":true,"merged":[[73,1,73,17],[0,0,0,17],[1,0,1,17],[2,0,2,1],[2,15,2,17],[3,15,3,17],[60,1,60,2],[60,15,60,16],[67,1,67,2],[68,12,68,17],[70,1,70,17],[71,1,71,17],[72,1,72,17]]}
["Association intercantonale \ndes joueurs de boules\nGrand Jeu Neuchâtelois"]
[{"$f":"CONCATENATE(\"Championnat grand jeu neuchâtelois \",YEAR(Calendrier!B6))","v":"Championnat grand jeu neuchâtelois 2020"}]
["Classement général individuel",null,"Manches",{"$f":"Calendrier!F40","v":"Le Locle"},{"$f":"Calendrier!F47","v":"Grand-Sommartel"},{"$f":"Calendrier!F54","v":"L'Epi"},{"$f":"Calendrier!F61","v":"La  Chaux-de-Fonds"},{"$f":"Calendrier!F68","v":"Evologia"},{"$f":"Calendrier!F75","v":"La  Vue-des-Alpes"},{"$f":"Calendrier!F82","v":"00:00:00"},null,null,{"$f":"CONCATENATE(\"Général\",CHAR(10),\"les \",Qui!$A$402,\" meilleurs\")","v":"Général\nles 5 meilleurs"},null,null,{"$f":"CONCATENATE(\"Classement de la manche\",CHAR(10),Calendrier!F75,CHAR(10),\"du\",TEXT(Calendrier!F77,\" jj.mm\"),\" au\",TEXT(Calendrier!F80,\" jj.mm.aaaa\"))","v":"Classement de la manche\nLa  Vue-des-Alpes\ndu 09.11 au 12.11.2020"},null,null,null,null,{"$f":"CONCATENATE(TEXT(Calendrier!F77,\" jj.mm\"),\" au\",TEXT(Calendrier!F80,\" jj.mm.aaaa\"))","v":" 09.11 au 12.11.2020"}]
[null,null,null,1,2,3,4,5,6,7,8,9,null,null,null,{"$f":"CONCATENATE(\"Champion de jeu : \",CHAR(10),P5,\" \",Q5)","v":"Champion de jeu : \n "}]
[1,null,null,null,null,null,null,null,null,null,null,null,{"$f":"SUM(D5:L5*(D5:L5>=LARGE(D5:L5,Qui!$A$402)))","v":{"$error":"#NUM!"}},{"$f":"IFERROR((VLOOKUP(CONCATENATE(B5,C5),Qui!$D$301:$F$356,3,)),0)","v":0},1,null,null,0,{"$f":"IFERROR((VLOOKUP(CONCATENATE(P5,Q5),Qui!$D$301:$F$356,3,0)),0)","v":0}]
[2,null,null,null,null,null,null,null,null,null,null,null,{"$f":"SUM(D6:L6*(D6:L6>=LARGE(D6:L6,Qui!$A$402)))","v":{"$error":"#NUM!"}},{"$f":"IFERROR((VLOOKUP(CONCATENATE(B6,C6),Qui!$D$301:$F$356,3,)),0)","v":0},2,null,null,0,{"$f":"IFERROR((VLOOKUP(CONCATENATE(P6,Q6),Qui!$D$301:$F$356,3,0)),0)","v":0}]
{"$rows_left_out":69}
{"sheet":"Manche_7","index":9,"n_rows":74,"n_cols":19,"rows_kept":74,"cut":false,"hidden":true,"merged":[[73,1,73,17],[0,0,0,17],[1,0,1,17],[2,0,2,1],[2,15,2,17],[3,15,3,17],[60,1,60,2],[60,15,60,16],[67,1,67,2],[68,12,68,17],[70,1,70,17],[71,1,71,17],[72,1,72,17]]}
["Association intercantonale \ndes joueurs de boules\nGrand Jeu Neuchâtelois"]
[{"$f":"CONCATENATE(\"Championnat grand jeu neuchâtelois \",YEAR(Calendrier!B6))","v":"Championnat grand jeu neuchâtelois 2020"}]
["Classement général individuel",null,"Manches",{"$f":"Calendrier!F40","v":"Le Locle"},{"$f":"Calendrier!F47","v":"Grand-Sommartel"},{"$f":"Calendrier!F54","v":"L'Epi"},{"$f":"Calendrier!F61","v":"La  Chaux-de-Fonds"},{"$f":"Calendrier!F68","v":"Evologia"},{"$f":"Calendrier!F75","v":"La  Vue-des-Alpes"},{"$f":"Calendrier!F82","v":"00:00:00"},null,null,{"$f":"CONCATENATE(\"Général\",CHAR(10),\"les \",Qui!$A$402,\" meilleurs\")","v":"Général\nles 5 meilleurs"},null,null,{"$f":"CONCATENATE(\"Classement de la manche\",CHAR(10),Calendrier!F82,CHAR(10),\"du \",TEXT(Calendrier!F84,\" jj.mm\"),\" au \",TEXT(Calendrier!F87,\" jj.mm.aaaa\"))","v":"Classement de la manche\n\ndu  07.01 au  10.01.1900"}]
[null,null,null,1,2,3,4,5,6,7,8,9,null,null,null,{"$f":"CONCATENATE(\"Champion de jeu : \",CHAR(10),P5,\" \",Q5)","v":"Champion de jeu : \n "}]
[1,null,null,null,null,null,null,null,null,null,null,null,{"$f":"SUM(D5:L5*(D5:L5>=LARGE(D5:L5,Qui!$A$402)))","v":{"$error":"#NUM!"}},{"$f":"IFERROR((VLOOKUP(CONCATENATE(B5,C5),Qui!$D$301:$F$356,3,)),0)","v":0},1,null,null,0,{"$f":"IFERROR((VLOOKUP(CONCATENATE(P5,Q5),Qui!$D$301:$F$356,3,0)),0)","v":0}]
[2,null,null,null,null,null,null,null,null,null,null,null,{"$f":"SUM(D6:L6*(D6:L6>=LARGE(D6:L6,Qui!$A$402)))","v":{"$error":"#NUM!"}},{"$f":"IFERROR((VLOOKUP(CONCATENATE(B6,C6),Qui!$D$301:$F$356,3,)),0)","v":0},2,null,null,0,{"$f":"IFERROR((VLOOKUP(CONCATENATE(P6,Q6),Qui!$D$301:$F$356,3,0)),0)","v":0}]
{"$rows_left_out":69}
{"sheet":"Challenge_1","index":10,"n_rows":59,"n_cols":27,"rows_kept":59,"cut":false,"hidden":true,"merged":[[3,21,3,26],[56,7,56,8],[0,0,0,9],[1,0,1,9],[3,16,3,18]]}
["Association intercantonale\n des joueurs de boules,\nGrand Jeu Neuchâtelois\n"]
[{"$f":"CONCATENATE(Calendrier!A4,\"      Jeu : \",(Calendrier!F4))","v":"Challenge HIVER      Jeu : Evologia"}]
[null,null,null,null,null,null,null,null,null,{"$f":"CONCATENATE(\"du \",TEXT(Calendrier!F6,\" jj.mm\"),\" au \",TEXT(Calendrier!F9,\" jj.mm.aaaa\"))","v":"du  09.03 au  12.03.2020"}]
["Classement par équipes",null,null,null,null,null,null,"Classement individuel",null,null,null,null,"Equipe",null,null,null,"Equipes possibles",null,null,null,null,"Equipes triées"]
[null,null,null,null,null,null,null,null,null,null,null,null,null,null,null,null,"N°","Nom","Total équipe",null,null,"Rang","Nom","Prénom","Résultat","TotEquipe","Equipe"]
["1er",{"$f":"IF($D11,(INDEX($Q$6:$S$20,MATCH($AA6,$Q$6:$Q$20,0),2)),0)","v":"Le Locle I"},null,null,{"$f":"VLOOKUP(B6,Qui!$A$201:$D$204,4)","v":3},1,null,"Gerber","Michel",111,{"$f":"IFERROR((VLOOKUP(CONCATENATE(H6,I6),Qui!$D$301:$F$356,3,0)),0)","v":3},null,"L1",null,null,null,"C1","La Chaux-de-Fonds  I",{"$f":"SUMIF($M$6:$M$40,\"=\"&$Q6,$J$6:$J$40)","v":300},null,null,1,"Gerber","Michel",111,{"$f":"IF($AA6<>\"\",(IF($Y6,(INDEX($Q$6:$S$20,MATCH($AA6,$Q$6:$Q$20,0),3)),0)),0)","v":400},"L1"]
{"$rows_left_out":54}
{"sheet":"Challenge_2","index":11,"n_rows":59,"n_cols":27,"rows_kept":59,"cut":false,"hidden":true,"merged":[[0,0,0,9],[1,0,1,9],[3,16,3,18],[3,21,3,26],[56,7,56,8]]}
["Association intercantonale\n des joueurs de boules,\nGrand Jeu Neuchâtelois\n"]
[{"$f":"CONCATENATE(Calendrier!A25,\"      Jeu : \",(Calendrier!F25))","v":"Challenge ÉTÉ      Jeu : Le Locle"}]
[null,null,null,null,null,null,null,null,null,{"$f":"CONCATENATE(\"du \",TEXT(Calendrier!F27,\" jj.mm\"),\" au \",TEXT(Calendrier!F30,\" jj.mm.aaaa\"))","v":"du  15.06 au  18.06.2020"}]
["Classement par équipes",null,null,null,null,null,null,"Classement individuel",null,null,null,null,"Equipe",null,null,null,"Equipes possibles",null,null,null,null,"Equipes triées"]
[null,null,null,null,null,null,null,null,null,null,null,null,null,null,null,null,"N°","Nom","Total équipe",null,null,"Rang","Nom","Prénom","Résultat","TotEquipe","Equipe"]
["1er",{"$f":"IF($D11,(INDEX($Q$6:$S$20,MATCH($AA6,$Q$6:$Q$20,0),2)),0)","v":0},null,null,{"$f":"VLOOKUP(B6,Qui!$A$201:$D$204,4)","v":{"$error":"#N/A"}},1,null,"Bart","Fabien",0,{"$f":"IFERROR((VLOOKUP(CONCATENATE(H6,I6),Qui!$D$301:$F$356,3,0)),0)","v":3},null,null,null,null,null,"C1","La Chaux-de-Fonds  I",{"$f":"SUMIF($M$6:$M$40,\"=\"&$Q6,$J$6:$J$40)","v":0},null,null,1,"Bart","Fabien",0,{"$f":"IF($AA6<>\"\",(IF($Y6,(INDEX($Q$6:$S$20,MATCH($AA6,$Q$6:$Q$20,0),3)),0)),0)","v":0}]
{"$rows_left_out":54}
{"sheet":"Challenge_GJ","index":12,"n_rows":84,"n_cols":37,"rows_kept":84,"cut":false,"hidden":true,"merged":[[56,7,56,8],[3,28,3,30],[0,0,0,9],[1,0,1,9],[3,16,3,18],[3,21,3,26]]}
["Association intercantonale\n des joueurs de boules,\nGrand Jeu Neuchâtelois\n"]
[{"$f":"CONCATENATE(Calendrier!A11,\"      Jeu : \",(Calendrier!F11))","v":"Challenge 70ème      Jeu : L'Epi"}]
[null,null,null,null,null,null,null,null,null,{"$f":"CONCATENATE(\"du\",TEXT(Calendrier!F13,\" jj.mm\"),\" au\",TEXT(Calendrier!F16,\" jj.mm.aaaa\"))","v":"du 30.03 au 02.04.2020"}]
["Classement par équipes",null,null,null,null,null,null,"Classement individuel",null,null,null,null,"Club",null,null,null,"Clubs possibles",null,null,null,null,"Equipes triées (RE_xx)",null,null,null,null,null,null,"Clubs tri"]
[null,null,null,null,null,null,null,null,null,null,null,null,null,null,null,null,"N°","Nom","Total club",null,null,"Rang","Nom","Prénom","Résultat","Total Club","Club",null,"N°","Nom","Total club"]
["1er",{"$f":"IF($D12,(INDEX($Q$6:$S$20,MATCH($AA6,$Q$6:$Q$20,0),2)),0)","v":"L'Epi"},null,null,{"$f":"VLOOKUP(B6,Qui!$A$201:$D$204,4)","v":4},1,null,"Bourquin","Willy",400,{"$f":"IFERROR((VLOOKUP(CONCATENATE(H6,I6),Q_NP_ClNom_ClNo,3,0)),0)","v":4},null,{"$f":"K6","v":4},null,null,null,{"$f":"Qui!D201","v":1},{"$f":"Qui!F201","v":"La Chaux-de-Fonds"},{"$f":"SUMPRODUCT(LARGE((CI_NoClub=$Q6)*(CI_Resultat),{1;2;3;4;5}))","v":111},null,null,1,"Bourquin","Willy",400,{"$f":"IF($AA6<>\"\",(IF($Y6,(INDEX($Q$6:$S$20,MATCH($AA6,$Q$6:$Q$20,0),3)),0)),0)","v":444},4,null,4,"L'Epi",444,{"$f":"LARGE(RE_TotClub,1)","v":444},{"$f":"LARGE(RE_TotClub,2)","v":444},{"$f":"LARGE(RE_TotClub,3)","v":444},{"$f":"LARGE(RE_TotClub,4)","v":444},null,{"$f":"INDEX(RE_TotClub,$AE$6,1)","v":{"$error":"#REF!"}}]
{"$rows_left_out":79}
{"sheet":"Champions_AN","index":13,"n_rows":42,"n_cols":5,"rows_kept":42,"cut":false,"hidden":true,"merged":[[0,0,0,4],[1,1,1,4]]}
["Association intercantonale \ndes joueurs de boules\nGrand Jeu Neuchâtelois"]
[null,{"$f":"CONCATENATE(\"Récapitulatif pour l'année   \",YEAR(Calendrier!B6))","v":"Récapitulatif pour l'année   2020"}]
[]
[]
[]
[null,{"$f":"Calendrier!A4","v":"Challenge HIVER"},{"$f":"Calendrier!F4","v":"Evologia"},{"$f":"Challenge_1!H57","v":"Champion de jeu : Gerber Michel"},{"$f":"Challenge_1!J57","v":111}]
{"$rows_left_out":37}
{"sheet":"A Ameliorer","index":14,"n_rows":12,"n_cols":5,"rows_kept":12,"cut":false,"hidden":true,"merged":[]}
["Date","Qui","Accepté","Réalisé ","Quoi"]
["2019-09-01","Daniel",null,"2020-02-02","Mentionner la date d'arrivée dans l'Intercantonale pour chaque joueur ==> jubilaire"]
["2019-09-01","Daniel",null,"2020-02-02","Mentionner la date de naissance pour chaque joueur ==> sympa"]
["2019-09-01","Daniel","2020-04-09",null,"Intégrer toutes les compétitions"]
["2019-10-31","Daniel",null,"2019-12-31","Interdiction de relancer Tri si déjà fait"]
["2019-09-17","Daniel",null,"2019-09-17","Affichage des chiffres à virgule ==> suppression des décimales "]
{"$rows_left_out":6}